program: Gaussian 09
title: 000237451
version: EM64L-G09RevD.01
frameworkgroup: C1[X(C14H20O4)]
method: RPBEPBE
basis: SDD
operation: Freq
keyword: #pfreq=noraman
keyword: PBEPBE/SDD
title: #p freq=noraman PBEPBE/SDD
converged: YES YES NO NO
title: Mulliken charges:
elementType: O O O O C C C C C C C C C C C C C C H H H H H H H H H H H H H H H H H H H H
charge: -0.291658 -0.246300 -0.437430 -0.265988 -0.051068 -0.406495 -0.368123 -0.142740 -0.356669 -0.397011 0.348718 -0.330024 -0.344085 -0.384799 -0.346877 -0.342286 0.322509 -0.537814 0.222493 0.204584 0.215811 0.234622 0.211875 0.249365 0.188802 0.222750 0.214353 0.186702 0.185449 0.216791 0.260082 0.257930 0.251201 0.239424 0.328736 0.219231 0.245996 0.221941
chargesum: 0.00000
title: Mulliken charges with hydrogens summed into heavy atoms:
elementType: O O O O C C C C C C C C C C C C C C
charge: -0.291658 -0.246300 -0.108694 -0.265988 0.171425 0.013900 0.078374 0.106626 0.054883 0.004044 0.348718 0.072216 -0.084003 -0.126869 -0.095675 -0.102862 0.322509 0.149354
polarizability: 1.86243112e+02 1.48824117e+01 1.83924350e+02 -1.16947633e+01 1.95562023e+00 1.15679268e+02
1716.lowfreq: -13.6683 -4.7816 -0.0005 0.0003 0.0005 6.9127 11.8631 25.2191 49.2574
frequency: 9.1820 25.1915 49.1994 59.0451 69.8213 81.2216 110.8932 124.9042 137.8062 149.2150 168.4597 214.8363 233.0648 246.2236 259.5776 285.8195 318.3237 329.5191 368.4010 413.1459 430.7181 457.1474 465.0687 475.8196 507.8460 562.3605 624.6721 637.1315 691.4320 709.7446 732.3929 762.9478 770.9525 810.6199 812.6845 825.7249 862.9403 869.5286 898.9181 925.0053 948.3140 957.2068 966.0840 974.3290 988.0447 1003.5514 1009.0591 1022.8088 1035.8575 1068.4255 1076.4257 1087.5917 1105.3837 1109.2056 1113.0157 1152.3437 1155.7483 1171.6081 1189.2952 1207.5422 1227.8619 1228.7565 1237.8101 1247.6176 1273.8325 1287.2910 1293.4683 1296.2521 1297.7242 1308.5432 1320.3870 1337.5081 1357.7138 1368.9960 1377.0449 1384.3338 1414.5900 1436.5551 1448.6639 1465.5600 1466.9818 1468.0228 1472.6621 1474.7234 1488.2991 1497.9004 1582.7367 1622.0543 2948.1165 2956.3448 2958.6698 2963.9040 2972.5056 2980.9315 2994.4741 3012.4048 3027.3151 3036.0267 3046.1101 3048.6654 3073.5124 3106.8136 3124.8159 3143.5757 3144.3098 3163.9840 3169.6170 3558.9543
redmass: 5.5886 3.8881 4.0214 2.9330 2.1828 4.0013 3.0775 3.6975 3.0799 2.3860 3.5568 2.5856 1.3365 3.8264 4.4939 4.3709 1.1529 5.0900 3.3818 3.0767 5.0961 3.2930 3.3932 3.4360 3.0833 4.5478 5.7418 4.1827 5.5385 3.9020 1.2664 2.9482 2.1861 1.9584 1.5210 1.4322 2.8524 4.3504 1.6183 2.9154 4.9484 1.5522 2.7658 1.3509 8.4054 2.6810 2.1848 5.2255 3.9664 2.5040 2.5183 1.6583 1.8935 1.3354 1.2595 1.6367 1.3339 1.2481 1.2111 2.3471 3.5094 1.2776 1.3316 1.2958 1.2651 1.0811 1.1744 1.2564 1.2669 1.2597 1.1839 1.2801 1.4220 1.6608 5.1439 1.2628 3.9751 1.1720 1.0847 1.0721 1.0505 1.0903 1.0784 1.0865 1.0954 2.4406 7.3979 6.4106 1.0693 1.0631 1.0331 1.0607 1.0625 1.0691 1.0839 1.0940 1.0968 1.0875 1.1039 1.1016 1.0978 1.0995 1.0992 1.0872 1.0882 1.0953 1.0967 1.0661
irintensity: 0.1136 1.0463 2.7399 0.4603 5.9974 3.2006 1.5362 2.3375 7.4865 0.5850 0.4794 1.3489 2.1797 5.0081 0.9934 8.2788 144.5863 3.4067 14.0301 0.0841 0.3330 4.8489 3.8393 10.6597 18.0790 28.1373 0.3287 5.8824 5.5499 4.4017 3.5580 16.3084 4.9304 60.2415 5.9829 10.2354 31.3615 90.5311 16.9209 10.0120 63.0109 29.1337 5.0441 0.0824 43.0573 35.5700 11.5410 127.1029 31.2588 13.3212 18.3043 12.6893 10.5505 10.5397 0.2225 2.0363 1.0373 95.3870 5.1859 12.0980 188.7432 17.9436 18.5320 2.2648 7.0846 1.1246 10.1360 47.2435 3.2859 5.2543 0.9936 2.7107 6.4929 3.5853 9.7894 20.2483 3.6982 8.5739 3.3644 0.4506 14.1221 6.3131 52.2866 1.8579 14.7286 74.3339 15.0733 72.9247 57.8065 10.3624 64.0165 5.1530 57.6453 45.1580 40.1425 7.3225 17.6224 30.9674 50.6790 67.7364 63.9438 33.8306 26.0965 4.5893 3.1796 14.6519 4.8123 6.8825
temp: 298.150 k
press: 1.00000 atm
elementType: 8 8 8 8 6 6 6 6 6 6 6 6 6 6 6 6 6 6 1 1 1 1 1 1 1 1 1 1 1 1 1 1 1 1 1 1 1 1
symmnumber: 1
zpe: 831071.4 jmol-1
zpe.correction: 0.316538 hartree
zpe.thermalcorrener: 0.335104 hartree
zpe.thermalcorrenthalpy: 0.336048 hartree
zpe.thermalcorrgfe: 0.266726 hartree
zpe.sumelectzpe: -844.942704 hartree
zpe.sumelectthermal: -844.924139 hartree
zpe.sumelectthermalent: -844.923194 hartree
zpe.sumelectthermalfe: -844.992517 hartree
dipole: 1.0064 1.9400 -0.8696
dipole: 2.3522
quadrupole: -129.9941 -98.5357 -108.7671
quadrupole: 16.9966 1.8463 4.9104
quadrupole: -17.5618 13.8966 3.6652 16.9966 1.8463 4.9104
hfenergy: -845.2592428 hartree
pointgroup: C01 [X(C14H20O4)]
dipole: -0.4304085 0.7068111 0.4142092 debye
polarizability: 187.685012|-13.4899547|182.502908|-12.3799597|4.4773055|115.6588104 unknown
InChI: InChI=1S/C14H20O4/c1-16-12-7-5-11(6-8-12)14-17-10-13(18-14)4-2-3-9-15/h5-8,13-15H,2-4,9-10H2,1H3
charge 0 multiplicity 1
38 atoms
O  1.012046 -1.496836 -1.191894
O  -0.287282 -3.184739 -0.193568
O  5.689722 3.058914 0.565799
O  -4.28017 1.822193 0.637262
C  1.764725 -1.979973 0.014874
C  2.385228 -0.795852 0.767713
C  0.703682 -2.769805 0.822991
C  -0.361293 -2.0298 -1.101221
C  3.4318 -0.031253 -0.071397
C  4.031103 1.178984 0.679657
C  -1.351658 -0.974539 -0.612767
C  5.080739 1.930197 -0.158952
C  -2.586515 -1.378995 -0.039122
C  -1.09421 0.404079 -0.776055
C  -3.534778 -0.425485 0.369817
C  -2.038818 1.376204 -0.372593
C  -3.264602 0.956822 0.201284
C  -4.06197 3.260684 0.47094
H  2.555929 -2.654554 -0.367017
H  2.861956 -1.180114 1.69424
H  1.57399 -0.109193 1.08036
H  1.092006 -3.69009 1.283924
H  0.225926 -2.126083 1.589184
H  -0.632891 -2.437239 -2.090998
H  4.248463 -0.725508 -0.360032
H  2.955944 0.300381 -1.015087
H  4.505323 0.846951 1.624276
H  3.214212 1.878458 0.960519
H  4.632234 2.27213 -1.117642
H  5.933226 1.270426 -0.394685
H  -2.78838 -2.446786 0.097953
H  -0.141716 0.71356 -1.218914
H  -4.4874 -0.721812 0.819382
H  -1.812157 2.437752 -0.510679
H  4.974619 3.696125 0.819099
H  -3.180797 3.604808 1.047132
H  -4.971323 3.736626 0.866194
H  -3.934616 3.52846 -0.596172
