program: Gaussian 09
title: 000237440
version: EM64L-G09RevD.01
frameworkgroup: C1[X(C11H12O4S)]
method: RPBEPBE
basis: SDD
operation: Freq
keyword: #p
keyword: freq=noraman
keyword: PBEPBE/SDD
title: #p freq=noraman PBEPBE/SDD
converged: YES YES NO NO
title: Mulliken charges:
elementType: S O O O O C C C C C C C C C C C H H H H H H H H H H H H
charge: 0.892694 -0.559400 -0.531608 -0.174864 -0.255889 -0.709166 -0.024458 0.262572 -0.578827 -0.284153 -0.237460 0.300522 -0.202901 -0.212238 -0.214571 -0.768799 0.332237 0.311564 0.272222 0.288153 0.299163 0.299014 0.245033 0.244987 0.239981 0.232410 0.250219 0.283562
chargesum: 0.00000
title: Mulliken charges with hydrogens summed into heavy atoms:
elementType: S O O O O C C C C C C C C C C C
charge: 0.892694 -0.559400 -0.531608 -0.174864 -0.255889 -0.065365 -0.024458 0.262572 -0.018452 0.015010 0.061554 0.300522 0.042132 0.032749 0.025409 -0.002607
polarizability: 2.04236717e+02 -6.95109432e+00 1.54943262e+02 6.30560656e+00 -1.37090440e+00 1.05166833e+02
1716.lowfreq: -3.4316 -0.0024 -0.0021 0.0003 4.1683 6.9425 32.9214 42.5020 53.7986
frequency: 32.7699 42.4668 53.7756 68.3747 80.5062 98.6465 136.7226 146.1424 159.8968 196.2937 201.6944 233.6875 246.2449 279.9383 329.3344 343.9024 365.3049 403.3013 405.2445 423.8103 449.0750 494.7589 526.6790 591.2290 601.0484 601.9098 655.7197 691.4750 761.6649 776.0830 786.9414 835.0495 852.4445 854.8871 884.7703 934.0660 940.1141 976.1707 978.2779 987.7804 1007.1791 1007.8723 1022.8045 1047.0206 1080.3426 1122.1846 1172.6897 1173.9400 1177.2255 1184.9554 1228.5498 1244.0925 1309.7348 1312.1961 1359.1399 1365.8805 1383.0638 1390.9536 1436.4195 1445.7393 1453.9686 1455.2348 1575.7450 1603.0842 1608.0779 1625.5383 2981.6166 2985.5851 3035.1714 3043.1911 3074.2484 3124.6733 3138.4913 3146.3179 3151.8121 3152.8174 3163.4222 3174.7231
redmass: 4.8767 4.5416 7.5680 3.8023 5.2998 6.9231 5.1100 1.2066 3.8071 6.3839 5.2571 4.4115 7.9215 3.7262 5.3959 3.7518 5.1632 3.5734 4.9276 2.0754 6.6107 3.8774 4.3046 3.8114 4.2621 5.4436 7.1104 2.4514 1.4395 3.6834 9.1758 2.0736 2.6018 1.2618 2.8505 3.6301 1.3541 4.4778 2.1706 1.4001 1.5266 3.1240 1.8262 2.0861 1.5673 1.2951 1.8983 1.0834 1.5530 1.1358 1.4848 1.7163 1.2877 1.9200 1.1236 1.2385 8.1792 1.1071 2.2434 1.0739 1.0737 1.9307 5.7039 6.8407 9.9502 7.5813 1.0560 1.0415 1.0558 1.0959 1.0956 1.1009 1.0859 1.0887 1.1084 1.0938 1.0970 1.1017
irintensity: 0.8841 1.6140 1.1032 4.3841 8.9993 4.1460 3.0617 1.5780 3.3893 6.1337 6.3567 4.7274 12.2956 2.4898 6.7303 4.5516 6.8048 4.0876 6.8138 0.8905 52.2400 47.6939 58.2139 12.1544 4.3737 1.8668 5.5335 31.1339 75.7754 19.1632 43.3973 3.1686 2.4840 1.2920 38.5473 70.3436 3.0546 0.6026 5.8211 0.6632 0.2255 0.9664 5.3362 22.4448 4.9563 4.4670 61.7027 6.0370 92.9781 1.2945 20.5975 75.8053 3.0349 75.6232 49.3643 83.6631 5.6559 75.1054 17.9452 29.1966 10.1515 20.2294 5.2514 0.5057 176.9272 101.5967 0.8786 3.0800 8.4847 3.6937 13.2208 10.6681 2.2903 11.4138 5.7641 0.6409 3.3920 31.3964
temp: 298.150 k
press: 1.00000 atm
elementType: 16 8 8 8 8 6 6 6 6 6 6 6 6 6 6 6 1 1 1 1 1 1 1 1 1 1 1 1
symmnumber: 1
zpe: 540675.6 jmol-1
zpe.correction: 0.205932 hartree
zpe.thermalcorrener: 0.222665 hartree
zpe.thermalcorrenthalpy: 0.223609 hartree
zpe.thermalcorrgfe: 0.160401 hartree
zpe.sumelectzpe: -1123.967169 hartree
zpe.sumelectthermal: -1123.950437 hartree
zpe.sumelectthermalent: -1123.949492 hartree
zpe.sumelectthermalfe: -1124.012701 hartree
dipole: -2.5670 3.8302 -1.1535
dipole: 4.7530
quadrupole: -80.4407 -107.9337 -111.3013
quadrupole: 7.3554 10.1740 3.2399
quadrupole: 19.4512 -8.0418 -11.4094 7.3554 10.1740 3.2399
hfenergy: -1124.1731019 hartree
pointgroup: C01 [X(C11H12O4S1)]
dipole: 0.8132184 -0.800833 1.4812521 debye
polarizability: 201.1584151|0.4797728|109.3483829|14.922445|-14.5890963|153.8400134 unknown
InChI: InChI=1S/C11H12O4S/c1-9(12)7-10(13)8-16(14,15)11-5-3-2-4-6-11/h2-6H,7-8H2,1H3
charge 0 multiplicity 1
28 atoms
S  0.049293 0.528035 -0.997228
O  -0.988638 1.138942 0.11856
O  0.53892 1.445635 -2.255576
O  -2.700312 -1.36901 -3.093446
O  -1.870511 -1.908013 0.851563
C  -0.732297 -1.130849 -1.737132
C  1.600896 -0.098249 -0.09866
C  -2.230372 -1.059697 -1.966478
C  -3.138665 -0.625448 -0.820515
C  2.83709 0.224081 -0.67883
C  1.447671 -0.808499 1.104037
C  -2.726893 -1.012022 0.608818
C  4.003839 -0.207188 -0.004867
C  2.628522 -1.233385 1.757026
C  3.897086 -0.933777 1.204463
C  -3.43033 -0.252602 1.715577
H  -0.511009 -1.876331 -0.954606
H  -0.177672 -1.280602 -2.674983
H  -4.155989 -1.010525 -1.028647
H  -3.207483 0.481584 -0.847778
H  2.875146 0.799709 -1.6100
H  0.457543 -1.023144 1.520729
H  4.9883 0.026157 -0.423152
H  2.553695 -1.793973 2.694396
H  4.804894 -1.264524 1.720386
H  -4.495903 -0.077311 1.483664
H  -3.330919 -0.783928 2.67462
H  -2.940201 0.73703 1.799457
