program: Gaussian 09
title: 000237453
version: EM64L-G09RevD.01
frameworkgroup: C1[X(C17H34O2)]
method: RPBEPBE
basis: SDD
operation: Freq
keyword: #pfreq=noraman
keyword: PBEPBE/SDD
title: #p freq=noraman PBEPBE/SDD
converged: YES YES NO NO
title: Mulliken charges:
elementType: O O C C C C C C C C C C C C C C C C C H H H H H H H H H H H H H H H H H H H H H H H H H H H H H H H H H H
charge: -0.269725 -0.236589 -0.050555 -0.005506 -0.388931 0.015657 -0.427536 -0.415624 -0.455376 -0.381729 -0.356634 -0.377072 -0.712764 -0.384156 -0.372096 -0.701266 -0.353306 -0.356626 -0.696934 0.238301 0.172592 0.242797 0.177318 0.173788 0.194097 0.207595 0.198083 0.212441 0.209264 0.225975 0.180275 0.229126 0.237179 0.184432 0.189474 0.197131 0.219039 0.218301 0.222030 0.195032 0.190591 0.188702 0.190160 0.203942 0.217340 0.213601 0.188040 0.187046 0.194438 0.195011 0.209302 0.214565 0.209758
chargesum: 0.00000
title: Mulliken charges with hydrogens summed into heavy atoms:
elementType: O O C C C C C C C C C C C C C C C C C
charge: -0.269725 -0.236589 0.187746 0.167086 0.031185 0.189445 -0.025844 -0.005100 -0.020137 0.027672 0.064977 0.009533 -0.053394 0.001468 0.006766 -0.066382 0.021780 0.032823 -0.063309
polarizability: 2.39507698e+02 1.63259906e+00 1.86943966e+02 4.32956748e-01 -1.43074988e+00 1.52652979e+02
1716.lowfreq: -21.4200 -8.3483 -0.0017 -0.0010 0.0015 2.9926 7.4218 15.3875 29.8632
frequency: -16.2564 14.5189 29.7215 44.2066 55.8999 59.1669 65.2272 68.0951 81.1068 92.0796 100.5890 117.7828 133.1107 139.3939 162.7956 172.2854 177.0803 220.2346 222.0528 225.8348 226.6700 266.2705 289.3669 292.6814 318.1909 337.4279 366.1750 424.2886 442.6171 472.9144 483.2600 497.7589 527.9506 556.0971 647.4937 717.6221 722.9234 736.7554 738.1648 759.5148 770.6138 814.4649 819.1181 870.6173 879.5399 887.5281 891.5004 909.4374 929.7509 938.1595 943.7436 966.2266 992.7875 1003.4114 1007.6120 1023.9030 1035.5691 1041.7934 1050.8713 1068.1338 1073.0054 1080.4540 1081.9851 1083.2069 1094.1429 1110.1950 1121.4234 1132.0057 1140.1977 1146.1201 1172.8458 1188.8791 1210.8745 1214.8114 1226.0459 1232.5575 1240.7970 1253.9994 1258.1849 1271.7251 1277.7704 1281.7184 1283.2406 1289.4871 1290.0969 1292.5704 1296.0559 1300.1819 1309.4115 1323.3757 1331.0012 1344.5351 1346.3201 1349.8743 1353.7711 1356.8588 1361.3435 1365.8852 1386.1948 1387.3865 1389.3554 1395.1973 1449.1843 1452.0967 1458.6005 1460.9519 1461.3352 1465.7682 1470.0192 1471.6160 1474.4599 1475.9285 1477.6362 1478.9381 1480.8816 1485.4296 1485.8955 1488.8137 1489.9226 2862.5082 2886.4848 2911.7025 2948.9528 2949.7180 2952.5226 2958.4818 2964.3869 2965.4102 2967.9227 2969.1384 2970.5476 2971.9558 2979.5030 2982.1921 2983.0664 2990.5843 2995.2060 2998.7642 3003.0187 3018.7086 3029.8042 3032.3928 3033.7122 3040.9126 3048.1672 3067.0083 3067.7756 3069.1173 3071.2141 3073.0458 3073.2095 3078.3642 3088.5298
redmass: 1.5870 3.5253 3.9001 3.4555 1.6485 2.5273 2.4281 2.1836 2.0592 2.8315 3.2947 2.5110 1.8803 2.2031 3.4774 3.5182 2.9228 2.8869 1.3367 1.1338 1.2543 1.9781 2.8899 3.4085 2.8708 3.8962 2.2869 3.2556 3.5208 4.2750 3.0028 3.0924 3.3227 3.0272 3.5697 1.0614 1.0965 1.2301 1.1920 1.2778 1.3576 1.5502 1.7940 1.4518 2.0080 1.8882 1.6734 1.8451 1.7460 1.7611 2.7907 2.2100 4.2779 2.5101 1.3690 3.6371 2.5102 2.3843 3.2887 2.5623 2.0947 2.4108 2.1050 2.2067 1.8750 2.4037 2.5468 2.0347 2.3275 2.1082 2.1557 1.7022 1.3256 1.2978 1.4273 1.3017 1.2898 1.3017 1.2847 1.2442 1.0254 1.1722 1.1697 1.0908 1.2320 1.1271 1.1658 1.2083 1.2307 1.3567 1.3885 1.3108 1.4629 1.3640 1.6684 1.5768 1.5625 1.3796 1.6287 1.2176 1.2937 1.2176 1.0833 1.0835 1.0898 1.0730 1.0690 1.0710 1.0672 1.0782 1.0509 1.0427 1.0436 1.0802 1.0508 1.0886 1.0814 1.0943 1.0547 1.0823 1.0813 1.0696 1.0589 1.0588 1.0593 1.0601 1.0636 1.0650 1.0589 1.0410 1.0367 1.0596 1.0367 1.0600 1.0960 1.0977 1.0821 1.0619 1.0988 1.1019 1.0953 1.1015 1.0956 1.1027 1.1002 1.1009 1.1028 1.0993 1.0990 1.1007 1.0996 1.0992 1.0937
irintensity: 0.0028 0.1008 0.1854 0.2560 0.1096 0.0813 0.1058 0.3959 0.3140 0.3210 0.1920 0.1252 0.0565 0.0909 0.1535 0.6777 0.4794 3.5215 1.4203 0.0612 0.6720 3.4497 0.7428 0.5908 0.7101 2.6671 0.1383 2.7395 0.7063 3.1621 0.8394 0.1979 8.0611 5.3600 4.1399 14.1369 0.5368 1.6783 3.2180 12.0573 14.4775 15.0891 10.3932 26.6165 8.4906 5.5948 1.8435 9.0812 3.7841 44.8436 48.7305 49.9451 1.7072 8.9860 7.6521 20.5638 3.9139 21.8027 17.9926 3.1665 6.8400 11.2865 0.6946 9.3033 51.9441 36.1292 13.6225 13.3170 23.7342 11.6180 3.0188 3.5566 2.7721 11.2288 0.7407 6.8137 1.7386 1.7252 1.4639 0.6073 1.2181 0.9478 8.3629 0.6064 0.6098 1.2950 0.5810 17.3541 7.5937 1.0843 4.8311 16.9474 0.3562 2.9581 0.3253 2.1615 11.8400 2.2714 14.2258 11.1000 17.4918 14.0969 4.0861 5.2633 8.1775 0.0005 0.2096 0.1504 3.4878 0.7810 3.7779 12.1803 10.9197 2.0437 8.9315 1.1738 12.8199 30.3614 13.5279 53.1284 39.5986 74.4435 0.9857 0.6947 0.5391 16.5891 24.3596 26.2569 170.3197 44.5971 36.6025 14.9809 36.9637 37.1628 1.5798 1.7258 29.3823 23.6128 5.3802 2.0285 20.1201 25.4913 16.6291 108.2471 2.3425 53.7681 105.8292 56.9596 53.9006 47.4607 90.9186 65.5080 31.0409
temp: 298.150 k
press: 1.00000 atm
elementType: 8 8 6 6 6 6 6 6 6 6 6 6 6 6 6 6 6 6 6 1 1 1 1 1 1 1 1 1 1 1 1 1 1 1 1 1 1 1 1 1 1 1 1 1 1 1 1 1 1 1 1 1 1
symmnumber: 1
zpe: 1259229.3 jmol-1
zpe.correction: 0.479615 hartree
zpe.thermalcorrener: 0.502943 hartree
zpe.thermalcorrenthalpy: 0.503887 hartree
zpe.thermalcorrgfe: 0.424148 hartree
zpe.sumelectzpe: -817.058963 hartree
zpe.sumelectthermal: -817.035635 hartree
zpe.sumelectthermalent: -817.034691 hartree
zpe.sumelectthermalfe: -817.114430 hartree
dipole: -1.6753 -0.6993 1.4203
dipole: 2.3050
quadrupole: -112.9331 -121.9551 -120.5970
quadrupole: 6.0034 -2.6556 0.1044
quadrupole: 5.5620 -3.4600 -2.1020 6.0034 -2.6556 0.1044
hfenergy: -817.5385781 hartree
pointgroup: C01 [X(C17H34O2)]
dipole: -0.6756607 0.0470656 0.6030302 debye
polarizability: 238.5173777|-7.5879983|182.9183344|-0.2010154|-12.2542035|157.6689304 unknown
InChI: InChI=1S/C17H34O2/c1-4-7-8-9-10-11-13-17-18-14-15(6-3)16(19-17)12-5-2/h15-17H,4-14H2,1-3H3
charge 0 multiplicity 1
53 atoms
O  -1.948497 1.213345 -0.49446
O  -1.294397 -1.012616 0.14722
C  -3.731119 -0.425654 0.084009
C  -3.309698 1.072329 0.092286
C  -2.612866 -1.261061 0.755563
C  -0.963795 0.411854 0.223738
C  -4.213418 2.005781 -0.726359
C  -5.089393 -0.650924 0.799211
C  0.396606 0.629556 -0.426389
C  1.545058 -0.081386 0.321934
C  -3.794042 3.490978 -0.643881
C  2.916817 0.138185 -0.353588
C  -5.560475 -2.123648 0.815114
C  4.077091 -0.568541 0.382417
C  5.451008 -0.352565 -0.291636
C  -4.701778 4.406183 -1.492524
C  6.612103 -1.062389 0.440555
C  7.986171 -0.844111 -0.233565
C  9.140142 -1.558855 0.502525
H  -3.811421 -0.746321 -0.974456
H  -3.263882 1.420689 1.154314
H  -2.78161 -2.342144 0.633842
H  -2.571848 -1.021878 1.844806
H  -0.978237 0.712282 1.303239
H  -5.258511 1.903648 -0.374405
H  -4.189696 1.671361 -1.782939
H  -5.020775 -0.274204 1.841638
H  -5.865577 -0.041456 0.299489
H  0.578746 1.720345 -0.46878
H  0.332538 0.265258 -1.46882
H  1.591076 0.286377 1.368928
H  1.321479 -1.163791 0.37697
H  -2.743803 3.581351 -0.975845
H  -3.821263 3.819132 0.415969
H  3.129512 1.226505 -0.413424
H  2.871025 -0.227284 -1.400726
H  -6.580528 -2.202714 1.23313
H  -5.582148 -2.543349 -0.208308
H  -4.902645 -2.765149 1.428628
H  3.864235 -1.656484 0.440283
H  4.122382 -0.205025 1.430575
H  5.66422 0.735764 -0.347454
H  5.404709 -0.713553 -1.340547
H  -5.756618 4.344353 -1.162298
H  -4.387512 5.463637 -1.42074
H  -4.667597 4.116865 -2.559948
H  6.401326 -2.151193 0.494654
H  6.659323 -0.703315 1.490175
H  8.196691 0.243802 -0.285819
H  7.937139 -1.201292 -1.282615
H  9.226699 -1.199871 1.545661
H  10.111149 -1.384089 0.00326
H  8.970204 -2.651718 0.538393
