program: Gaussian 09
title: 000237443
version: EM64L-G09RevD.01
frameworkgroup: C1[X(C16H18O4)]
method: RPBEPBE
basis: SDD
operation: Freq
keyword: #pfreq=noraman
keyword: PBEPBE/SDD
title: #p freq=noraman PBEPBE/SDD
converged: YES YES NO NO
title: Mulliken charges:
elementType: O O O O C C C C C C C C C C C C C C C C H H H H H H H H H H H H H H H H H H
charge: -0.217609 -0.188315 -0.251166 -0.255213 -0.256048 -0.439041 -0.411858 -0.392308 -0.514533 0.187970 0.148425 -0.660394 0.135539 0.306804 -0.300339 -0.356657 -0.375872 -0.354386 0.334606 -0.536646 0.314015 0.224846 0.235416 0.219595 0.196088 0.212200 0.215426 0.245159 0.226441 0.303568 0.264838 0.254888 0.275791 0.256773 0.246290 0.227469 0.250824 0.227412
chargesum: 0.00000
title: Mulliken charges with hydrogens summed into heavy atoms:
elementType: O O O O C C C C C C C C C C C C C C C C
charge: -0.217609 -0.188315 -0.251166 -0.255213 0.057968 0.021221 0.003826 0.035318 -0.042933 0.187970 0.148425 -0.091988 0.135539 0.306804 -0.045450 -0.080866 -0.119099 -0.108097 0.334606 0.169059
polarizability: 2.85891916e+02 1.08899086e+01 1.47992841e+02 -1.75963214e+01 1.51242211e+01 1.43013066e+02
1716.lowfreq: -24.5240 -1.5401 -0.0008 -0.0005 -0.0004 2.6470 15.2038 29.0376 42.7633
frequency: -3.3290 28.9916 42.7507 51.6591 75.5066 82.5769 87.9008 117.0030 131.7398 157.8370 203.4549 213.2884 229.6890 258.7497 293.7868 299.5800 310.3655 319.4982 387.4478 394.2570 408.4269 415.5390 457.3325 477.2253 490.2574 502.3615 548.8337 566.4418 591.0947 627.2057 645.0849 652.9997 713.5909 738.3781 763.4525 803.6827 820.4079 824.1073 838.3161 845.8661 853.8829 890.0927 910.0011 957.0953 970.2589 977.9739 981.6159 987.6069 990.1829 1006.0654 1043.5221 1068.6768 1081.9820 1104.1573 1111.0634 1115.9115 1118.0048 1152.4244 1157.5413 1169.2889 1174.5186 1217.9262 1229.4837 1235.8454 1242.2749 1248.7910 1277.2656 1281.7885 1297.3107 1303.8082 1313.4341 1333.7944 1339.1299 1343.8120 1374.3730 1411.5475 1430.8527 1437.2454 1444.0552 1465.9275 1466.4600 1469.9247 1471.2027 1478.5990 1499.9677 1552.6868 1581.5261 1611.4440 1617.1674 1621.6625 2918.4150 2950.8610 2969.9984 2972.1315 2972.5674 2986.3654 3002.4112 3038.9993 3049.2822 3057.3073 3062.6222 3068.2232 3073.5112 3133.9661 3149.8787 3152.4271 3169.3447 3175.6921
redmass: 5.7162 3.9186 4.6001 4.7561 4.5098 5.5539 7.2962 3.9448 4.3858 3.4882 3.8301 3.7525 1.2238 4.2156 3.5838 1.8603 4.5148 5.2461 3.9030 3.8176 3.3541 2.9506 3.4584 2.8543 3.2636 4.2441 3.4446 3.5355 4.1249 7.1039 3.2942 3.8501 3.3501 3.6821 3.7519 3.0885 2.4693 1.3038 1.8637 2.0426 2.2512 1.4609 2.7254 1.9337 2.1245 2.2472 4.5768 1.7296 2.6700 2.2708 1.5349 2.0145 1.3648 2.1425 1.2589 1.3361 2.4612 1.8539 1.3386 1.3005 1.2783 1.6327 2.0336 1.4890 3.0260 1.3083 1.4592 1.7568 1.5726 1.3568 1.6740 1.5687 1.4113 1.4970 4.9886 1.1192 3.4934 1.2659 1.0885 1.0845 1.0866 1.0540 1.0670 1.0885 2.4818 7.7730 7.3141 8.7491 9.6849 6.8625 1.0784 1.0643 1.0325 1.0650 1.0634 1.0616 1.0634 1.0958 1.1019 1.0925 1.1045 1.1018 1.0974 1.1002 1.0878 1.0877 1.0957 1.0970
irintensity: 0.7719 0.0354 3.5910 1.7749 1.2455 0.8163 3.2868 2.1756 8.0886 3.8857 11.7544 15.2637 1.7219 2.3344 2.1600 0.5129 7.5754 1.5464 4.9972 0.4865 0.6944 0.1373 4.5250 0.0718 6.9912 6.1522 13.7484 69.3412 28.2784 3.7408 2.9228 4.9793 4.3296 0.1846 4.8313 2.5068 17.2326 2.0875 61.2156 16.7129 10.7883 6.9533 2.1827 4.6181 7.0042 23.3121 46.2725 4.5002 57.9199 14.4129 12.7209 3.2507 5.9457 0.7064 0.1991 14.0661 48.7020 8.9950 0.4266 28.2507 246.8678 11.9920 132.2473 66.4661 188.5255 9.9091 39.3001 115.0980 115.6874 80.5525 138.5200 35.5223 1.1449 2.0213 46.4476 83.9682 0.7951 5.9972 12.6500 15.0360 10.1910 23.3739 45.7076 6.5093 23.5781 129.1285 127.6957 283.3512 148.7094 90.7683 41.4240 56.1200 64.7460 11.7860 29.2742 37.6482 12.8516 58.0635 44.7136 5.1601 40.8915 23.2994 26.3853 21.8720 0.9027 6.4229 14.1724 4.2302
temp: 298.150 k
press: 1.00000 atm
elementType: 8 8 8 8 6 6 6 6 6 6 6 6 6 6 6 6 6 6 6 6 1 1 1 1 1 1 1 1 1 1 1 1 1 1 1 1 1 1
symmnumber: 1
zpe: 799954.0 jmol-1
zpe.correction: 0.304686 hartree
zpe.thermalcorrener: 0.322873 hartree
zpe.thermalcorrenthalpy: 0.323817 hartree
zpe.thermalcorrgfe: 0.257419 hartree
zpe.sumelectzpe: -919.906440 hartree
zpe.sumelectthermal: -919.888253 hartree
zpe.sumelectthermalent: -919.887309 hartree
zpe.sumelectthermalfe: -919.953707 hartree
dipole: -3.0141 -3.4207 -1.0339
dipole: 4.6750
quadrupole: -79.3447 -122.0259 -123.4622
quadrupole: -1.9922 3.7640 5.6283
quadrupole: 28.9329 -13.7483 -15.1846 -1.9922 3.7640 5.6283
hfenergy: -920.2111259 hartree
pointgroup: C01 [X(C16H18O4)]
dipole: -1.1795755 1.0783694 -0.9103176 debye
polarizability: 288.0546068|2.2615803|156.434735|9.1394972|-11.0939625|132.4084808 unknown
InChI: InChI=1S/C16H18O4/c1-20-12-8-6-11(7-9-12)15(18)10-16(19)13-4-2-3-5-14(13)17/h6-9,13H,2-5,10H2,1H3
charge 0 multiplicity 1
38 atoms
O  2.209251 -1.974783 -1.480183
O  2.545393 -1.400108 2.344247
O  0.387563 1.175363 0.30643
O  -5.86345 -0.394016 -0.056305
C  2.977959 -0.324171 0.201822
C  4.448488 -0.176261 0.691269
C  5.324815 0.554644 -0.347073
C  5.303783 -0.176549 -1.707087
C  3.849187 -0.33716 -2.23109
C  2.934614 -0.982249 -1.19437
C  2.08105 -1.00038 1.242831
C  0.6032 -1.197551 0.916812
C  -0.186919 0.061371 0.520945
C  -1.66729 -0.069846 0.3865
C  -2.354402 -1.311465 0.526162
C  -2.427011 1.09368 0.088689
C  -3.74562 -1.384796 0.371288
C  -3.82301 1.038118 -0.065755
C  -4.487549 -0.21025 0.075922
C  -6.690835 0.77786 -0.37077
H  2.537554 0.690643 0.058713
H  4.862119 -1.180888 0.902156
H  4.441559 0.361476 1.655726
H  6.363593 0.626047 0.027534
H  4.959251 1.59381 -0.479852
H  5.762389 -1.178996 -1.595356
H  5.90269 0.371184 -2.45854
H  3.808982 -0.938276 -3.155635
H  3.440732 0.670092 -2.458051
H  0.565876 -1.905507 0.059528
H  0.128667 -1.685763 1.786499
H  -1.801612 -2.229718 0.746975
H  -1.890169 2.04195 -0.019578
H  -4.284562 -2.33141 0.47086
H  -4.379289 1.952054 -0.293016
H  -6.623196 1.540754 0.427892
H  -7.718309 0.391725 -0.430854
H  -6.399896 1.222671 -1.341288
