program: Gaussian 09
title: 000237439
version: EM64L-G09RevD.01
frameworkgroup: C1[X(C16H14N2O2S)]
method: RPBEPBE
basis: SDD
operation: Freq
keyword: #p
keyword: freq=noraman
keyword: PBEPBE/SDD
title: #p freq=noraman PBEPBE/SDD
converged: YES YES NO NO
title: Mulliken charges:
elementType: S O O N N C C C C C C C C C C C C C C C C H H H H H H H H H H H H H H
charge: 0.873481 -0.530442 -0.575905 -0.421903 -0.067764 -0.725289 0.495972 -0.036286 -0.503471 0.083521 0.343788 -0.264153 -0.265645 -0.203302 -0.201442 -0.372173 -0.364344 -0.215069 -0.246769 -0.231763 -0.239698 0.282964 0.281204 0.253710 0.374067 0.289572 0.290892 0.244615 0.244733 0.217494 0.270606 0.240764 0.224048 0.226198 0.227790
chargesum: 0.00000
title: Mulliken charges with hydrogens summed into heavy atoms:
elementType: S O O N N C C C C C C C C C C C C C C C C
charge: 0.873481 -0.530442 -0.575905 -0.047837 -0.067764 -0.161122 0.495972 -0.036286 -0.249761 0.083521 0.343788 0.025419 0.025246 0.041313 0.043290 -0.154679 -0.093738 0.025695 -0.022721 -0.005565 -0.011908
polarizability: 4.07860817e+02 -2.15228320e+00 1.94333859e+02 1.63120058e+01 3.29240830e+00 1.20698791e+02
1716.lowfreq: -5.1373 -0.0013 -0.0009 0.0013 1.8174 4.1536 18.7193 21.6836 30.5901
frequency: 18.3950 21.5017 30.5003 42.3998 51.7815 86.3039 107.8663 118.2206 152.8506 175.7817 180.1377 225.8192 244.1071 264.3344 320.2084 333.4440 334.2349 359.0108 401.5496 404.1695 431.4311 442.4123 487.4349 504.9988 533.0673 602.3869 615.2844 636.7838 654.0749 673.9314 677.0594 691.3951 699.1261 713.0429 739.5023 760.2518 777.8303 782.9387 824.5958 850.2489 853.7354 856.0499 928.8122 930.2430 933.4173 936.1923 978.3792 980.5635 985.0835 989.1059 1000.9355 1007.3715 1007.9064 1019.8861 1023.4047 1047.4479 1048.3745 1074.5532 1079.5470 1092.3730 1155.1412 1172.4561 1174.6519 1177.4560 1188.3139 1191.3937 1209.8423 1274.0812 1302.2873 1321.4014 1360.1502 1379.8699 1383.7983 1393.9242 1415.8241 1433.7723 1436.2839 1448.6214 1451.9277 1517.1237 1558.6758 1576.9345 1589.1426 1602.9643 1619.7528 3049.0805 3123.4457 3131.8764 3138.5846 3144.6048 3146.8693 3152.1102 3154.3897 3157.8123 3164.1063 3169.0441 3175.1078 3236.2313 3473.1386
redmass: 4.9370 4.4465 6.1153 4.4703 7.3118 5.7217 5.5688 5.9040 5.6411 7.3024 5.3239 6.2973 9.1974 3.6873 4.0194 5.6497 6.2245 9.3857 2.8049 2.8362 4.8418 6.3750 4.4965 4.2156 5.3571 6.4789 6.4316 5.4757 6.7159 6.4165 2.2353 2.4729 1.9416 2.1424 2.1857 1.4434 2.0652 3.7543 1.6756 1.6971 1.2809 1.4223 1.5075 3.9381 6.8639 1.3736 5.9759 1.3742 1.3894 6.2119 1.3329 1.3850 3.8501 2.8900 3.6224 2.1155 1.8246 1.5046 1.6793 1.3100 2.5652 1.0598 1.0578 1.1245 1.1599 1.1760 2.2300 3.5050 1.3044 1.4672 2.0733 4.3779 8.3794 3.1480 1.3387 2.4395 2.2386 2.5107 2.0326 3.8815 4.8834 5.8125 6.1342 6.8977 6.0812 1.0597 1.0846 1.0880 1.0858 1.0934 1.0883 1.1083 1.0927 1.0964 1.0970 1.1001 1.1017 1.0989 1.0845
irintensity: 0.4949 0.4761 0.6171 0.9826 0.3344 5.7069 1.5015 4.7692 2.2543 13.8992 0.6401 1.0831 14.5400 12.8303 24.5495 10.7822 0.8124 12.6134 0.0105 0.0111 5.5083 34.8825 55.3886 40.6422 22.0178 0.0382 0.0121 8.1532 1.0682 27.9951 4.9483 29.9882 43.2740 63.8070 40.7230 95.8700 29.0914 90.5348 38.0035 2.0026 0.7572 1.7006 8.2649 61.0433 28.5762 2.9815 7.0144 0.1412 0.2057 0.1905 0.6727 0.4610 2.3080 6.2586 9.4384 29.8181 13.1594 3.6901 17.6374 6.5159 4.9447 0.0281 0.2263 14.7178 45.4362 6.5184 46.6960 4.3883 3.6148 29.5573 76.7455 21.3076 5.1921 8.5976 10.8193 41.1325 14.4044 15.2743 15.7641 0.4339 0.8144 7.2452 1.5646 0.5561 11.0378 19.1090 5.0367 4.1007 0.9731 36.5092 7.9582 0.1083 0.1581 26.7689 5.2203 20.2524 35.2889 0.5045 213.1202
temp: 298.150 k
press: 1.00000 atm
elementType: 16 8 8 7 7 6 6 6 6 6 6 6 6 6 6 6 6 6 6 6 6 1 1 1 1 1 1 1 1 1 1 1 1 1 1
symmnumber: 1
zpe: 690819.4 jmol-1
zpe.correction: 0.263119 hartree
zpe.thermalcorrener: 0.281828 hartree
zpe.thermalcorrenthalpy: 0.282772 hartree
zpe.thermalcorrgfe: 0.212885 hartree
zpe.sumelectzpe: -1274.470232 hartree
zpe.sumelectthermal: -1274.451524 hartree
zpe.sumelectthermalent: -1274.450579 hartree
zpe.sumelectthermalfe: -1274.520466 hartree
dipole: -4.8718 2.8498 -4.8666
dipole: 7.4525
quadrupole: -92.6525 -123.4939 -140.8053
quadrupole: -0.8095 12.0803 0.3018
quadrupole: 26.3314 -4.5100 -21.8214 -0.8095 12.0803 0.3018
hfenergy: -1274.7333516 hartree
pointgroup: C01 [X(C16H14N2O2S1)]
dipole: 1.9462494 -0.9249408 -1.9883224 debye
polarizability: 408.0010302|3.1842981|194.423718|-14.7810363|2.4523336|120.4687185 unknown
InChI: InChI=1S/C16H14N2O2S/c19-21(20,15-9-5-2-6-10-15)12-14-11-16(18-17-14)13-7-3-1-4-8-13/h1-11,17H,12H2
charge 0 multiplicity 1
35 atoms
S  2.257793 0.195147 0.764293
O  2.000522 -0.893488 1.953124
O  1.967532 1.809974 0.976113
N  -0.677685 1.355454 -0.120684
N  -2.02997 1.443121 0.109458
C  1.116494 -0.228457 -0.863021
C  -0.282946 0.09162 -0.551502
C  4.055244 0.024906 0.187196
C  -1.459709 -0.677267 -0.620898
C  -2.524939 0.195732 -0.223391
C  -3.971327 -0.081363 -0.135115
C  4.666962 1.137501 -0.41313
C  4.704907 -1.196307 0.431133
C  6.015468 1.000706 -0.818915
C  6.052823 -1.311803 0.017921
C  -4.494951 -1.359058 -0.469687
C  -4.869793 0.935091 0.292295
C  6.69986 -0.22021 -0.609152
C  -5.879677 -1.615064 -0.379293
C  -6.252362 0.677135 0.381986
C  -6.76583 -0.598683 0.046548
H  1.608524 0.439355 -1.588087
H  1.300695 -1.289243 -1.080521
H  -1.528391 -1.716335 -0.933283
H  -0.03385 2.082466 0.21528
H  4.120835 2.080331 -0.522717
H  4.185005 -2.008648 0.950065
H  6.529491 1.846643 -1.286745
H  6.595553 -2.24637 0.193184
H  -3.82219 -2.158618 -0.799948
H  -4.46449 1.918175 0.551274
H  7.744908 -0.31687 -0.922547
H  -6.267095 -2.606421 -0.639842
H  -6.931705 1.470172 0.71418
H  -7.840907 -0.797925 0.116731
