program: Gaussian 09
title: 000237410
version: EM64L-G09RevD.01
frameworkgroup: C1[X(C5H4N2O2)]
method: RPBEPBE
basis: SDD
operation: Freq
keyword: #pfreq=noraman
keyword: PBEPBE/SDD
title: #p freq=noraman PBEPBE/SDD
converged: YES YES NO NO
title: Mulliken charges:
elementType: O O N N C C C C C H H H H
charge: -0.206721 -0.202208 -0.373532 0.011506 0.370619 -0.364149 0.056340 -0.226836 -0.131738 0.262078 0.349714 0.251082 0.203844
chargesum: 0.00000
title: Mulliken charges with hydrogens summed into heavy atoms:
elementType: O O N N C C C C C
charge: -0.206721 -0.202208 -0.023818 0.011506 0.370619 -0.102070 0.056340 0.024246 0.072106
polarizability: 1.12909418e+02 -1.22344529e+01 7.71276865e+01 -1.63520400e-03 -8.87978220e-03 2.97189152e+01
1716.lowfreq: 0.0006 0.0007 0.0008 4.0306 6.5769 10.3370 88.7286 136.2990 186.8251
frequency: 88.7230 136.2982 186.8250 264.4391 383.6865 432.8831 456.3172 549.0242 576.8499 664.5513 730.2676 741.3203 781.2383 834.8909 885.4692 923.7744 967.8241 977.3046 1080.6500 1163.6729 1186.3189 1331.2150 1355.9221 1370.1589 1446.5965 1551.9796 1575.5690 1599.1296 1629.0622 2969.7147 3134.3890 3171.5907 3489.4150
redmass: 6.6615 8.8922 7.1725 2.8532 11.1224 2.8428 7.3979 9.8412 4.3983 7.0418 2.3282 1.3700 6.3486 4.6190 1.5235 1.4867 1.7503 4.7284 4.6111 3.0372 1.4234 1.9066 1.2677 1.3617 5.7641 3.7684 9.7748 7.1947 7.1808 1.0895 1.0934 1.0932 1.0784
irintensity: 9.6925 7.0903 28.6957 5.8222 0.0546 15.5028 0.7898 1.2447 7.1260 7.3788 46.4663 65.0495 20.5501 7.0151 19.1346 11.4366 12.1372 14.2630 21.8867 75.2812 7.2583 43.0663 29.4520 12.1386 97.6178 242.7362 6.9510 334.9422 55.7039 58.2144 16.3367 0.5837 106.0303
temp: 298.150 k
press: 1.00000 atm
elementType: 8 8 7 7 6 6 6 6 6 1 1 1 1
symmnumber: 1
zpe: 231101.0 jmol-1
zpe.correction: 0.088022 hartree
zpe.thermalcorrener: 0.095331 hartree
zpe.thermalcorrenthalpy: 0.096275 hartree
zpe.thermalcorrgfe: 0.055736 hartree
zpe.sumelectzpe: -452.218713 hartree
zpe.sumelectthermal: -452.211404 hartree
zpe.sumelectthermalent: -452.210459 hartree
zpe.sumelectthermalfe: -452.250999 hartree
dipole: -4.6451 0.9903 0.0068
dipole: 4.7495
quadrupole: -77.4182 -41.9637 -51.2294
quadrupole: 2.8430 -0.0136 -0.0007
quadrupole: -20.5478 14.9067 5.6410 2.8430 -0.0136 -0.0007
hfenergy: -452.3067343 hartree
pointgroup: C01 [X(C5H4N2O2)]
dipole: 1.813534 -0.4503392 0.0024272 debye
dipolederiv: -0.9032994 0.3414088 -0.0000632 0.2718284 -0.6279211 0.0000972 -0.0002673 0.0000819 -0.3589951 -1.0122183 0.0456711 0.000453 0.326618 -0.5099079 -0.0005183 0.0005798 -0.0001142 -0.3232264 -0.8537279 -0.1675542 0.0001187 -0.0058631 -0.7347256 0.0001949 0.0004789 0.0002143 -0.1931117 -0.5599599 0.1490985 -0.0000825 0.44595 -0.7977975 0.000246 -0.0002749 0.0001369 -0.2739144 -0.615398 -0.0963372 0.0001989 -0.242301 0.5872955 -0.0006123 -0.0007797 -0.0005258 0.0779204 -0.304144 0.2207352 -0.000067 -0.2855767 -0.0494829 0.0001059 -0.0000191 0.0001053 -0.1141034 1.1658496 -0.4501592 0.0000443 -0.3042588 0.9156062 -0.0003147 0.0004196 -0.0002203 0.2444263 1.0713713 -0.0302268 0.0000479 -0.0455264 0.5421413 -0.0002081 0.0000718 -0.0001464 0.033308 1.5364219 -0.0806707 -0.0006969 0.023181 0.6937564 0.0013933 -0.0001821 0.0010416 0.1465835 0.0779894 -0.0580688 0.0000138 -0.0614886 -0.0077606 0.0000554 -0.000034 -0.0000023 0.1628365 0.2641978 0.0307997 -0.0000285 -0.075059 0.2616508 0.0000497 -0.0001416 -0.0000336 0.3441956 0.086076 0.051292 -0.0000307 0.0266554 -0.0850305 0.0001067 0.0000377 0.0001155 0.1326599 0.0468415 0.0440117 0.0000921 -0.0741592 -0.187824 -0.0005956 0.000111 -0.0006527 0.1214209 unknown
polarizability: 112.0543419|-13.3995058|77.982762|-0.0125663|-0.0047179|29.7189162 unknown
InChI: InChI=1S/C5H4N2O2/c8-2-4-1-5(9)7-3-6-4/h1-3,6H
charge 0 multiplicity 1
13 atoms
O  -2.706718 1.176573 -0.000516
O  3.206398 -0.008409 -0.002406
N  0.670772 -1.126303 0.000317
N  -1.726755 -0.973905 0.000205
C  0.821565 0.259508 -0.00045
C  -0.300627 1.0653 -0.000637
C  -1.659424 0.471956 -0.000297
C  -0.608148 -1.67231 0.000524
C  2.214367 0.769951 -0.000413
H  -0.209134 2.155817 -0.001021
H  1.521315 -1.700913 0.000891
H  -0.65847 -2.767858 0.001035
H  2.322858 1.876494 0.001968
