program: Gaussian 09
title: 000237409
version: EM64L-G09RevD.01
frameworkgroup: C1[X(C5H8N4S)]
method: RPBEPBE
basis: SDD
operation: Freq
keyword: #pfreq=noraman
keyword: PBEPBE/SDD
title: #p freq=noraman PBEPBE/SDD
converged: YES YES NO NO
title: Mulliken charges:
elementType: S N N N N C C C C C H H H H H H H H
charge: -0.036480 -0.094106 -0.093501 -0.633610 -0.635447 0.098218 0.236235 0.248303 -0.466677 -0.801248 0.215134 0.289122 0.275649 0.331112 0.310893 0.327772 0.311379 0.117252
chargesum: 0.00000
title: Mulliken charges with hydrogens summed into heavy atoms:
elementType: S N N N N C C C C C
charge: 0.080772 -0.094106 -0.093501 0.008395 0.003704 0.098218 0.236235 0.248303 -0.251543 -0.236477
polarizability: 1.24892106e+02 -3.89568908e+00 1.20338455e+02 -2.83035041e+00 -1.97128458e+00 5.63682032e+01
1716.lowfreq: -8.8506 -6.8920 -0.0022 0.0010 0.0021 7.4565 27.9826 97.9498 174.3793
frequency: 27.8961 97.9482 174.3791 206.4745 229.4204 267.0527 289.0648 314.1356 393.2972 400.3364 469.0412 492.1987 518.8104 535.2791 539.6731 579.0813 669.9721 676.9945 691.4680 751.0761 804.8085 833.3762 912.8124 923.4927 960.1921 1023.9208 1055.9288 1087.2650 1169.9863 1239.2372 1256.9487 1317.6638 1381.5081 1423.3806 1436.9795 1485.3889 1530.6657 1589.2135 1619.1608 1621.7281 2437.4611 3056.3065 3147.6448 3148.4056 3551.0173 3553.2298 3707.3295 3708.3667
redmass: 5.1110 6.8148 3.7003 3.9241 2.0403 3.2705 1.5622 2.9220 1.1976 1.1869 2.6694 1.1849 1.0628 4.7207 5.3641 5.2719 5.1132 11.2176 2.4534 1.7562 1.9306 2.5292 5.8507 1.8866 2.5774 2.2669 1.3650 2.5502 1.1691 1.8849 1.2339 4.6143 5.8321 2.3107 1.4737 3.8203 5.8691 1.9558 2.0434 1.4177 1.0377 1.0595 1.0929 1.1055 1.0447 1.0449 1.1047 1.1047
irintensity: 1.7625 2.6210 5.1703 3.4286 10.2824 16.4337 31.7136 5.2636 129.1985 218.3504 1.9012 247.4872 2.5103 10.5297 5.8247 0.9821 8.9681 0.2943 13.2836 2.5583 4.9741 64.3862 7.1271 3.6511 3.3977 5.7910 1.3413 0.3313 8.2723 60.3119 4.3682 26.4526 70.0196 7.5660 24.7484 143.3837 161.2457 100.4370 887.3448 108.8506 13.1413 15.7158 17.5234 2.2092 130.5865 25.2112 29.2827 37.0404
temp: 298.150 k
press: 1.00000 atm
elementType: 16 7 7 7 7 6 6 6 6 6 1 1 1 1 1 1 1 1
symmnumber: 1
zpe: 354734.7 jmol-1
zpe.correction: 0.135111 hartree
zpe.thermalcorrener: 0.145348 hartree
zpe.thermalcorrenthalpy: 0.146292 hartree
zpe.thermalcorrgfe: 0.098834 hartree
zpe.sumelectzpe: -811.669828 hartree
zpe.sumelectthermal: -811.659592 hartree
zpe.sumelectthermalent: -811.658648 hartree
zpe.sumelectthermalfe: -811.706105 hartree
dipole: 5.5931 1.5778 -0.1043
dipole: 5.8123
quadrupole: -58.4356 -52.0953 -69.8487
quadrupole: -2.0126 -6.0539 -1.3124
quadrupole: 1.6909 8.0313 -9.7222 -2.0126 -6.0539 -1.3124
hfenergy: -811.8049398 hartree
pointgroup: C01 [X(C5H8N4S1)]
dipole: -2.2814635 -0.1519812 0.0323607 debye
dipolederiv: -0.3030163 0.1488059 -0.0722208 0.2282785 -0.0237476 -0.0518436 -0.0158596 0.0008731 -0.1988753 -1.0367342 0.4796761 -0.0370523 0.229564 -0.8261067 -0.0406743 -0.1315393 0.0438358 -0.2470303 -1.0954836 -0.3949786 -0.1163041 -0.2407617 -0.8033357 -0.0290062 -0.1593443 -0.0913955 -0.2544945 -0.4269131 0.5463259 0.1258509 0.4925179 -1.3071971 0.0292032 0.1000051 0.0573662 -0.6942566 -0.4207028 -0.5184544 0.0537118 -0.5110564 -1.2580586 -0.1064681 0.0300582 -0.1327159 -0.7191586 1.0368326 -0.0751327 0.0373235 -0.0061899 0.8743636 0.0155841 0.1596749 0.0107782 -0.0427643 0.845204 -0.4735809 0.052041 -0.4969276 1.7134726 0.0378293 0.0686781 0.0173504 0.2421487 0.8651161 0.4032662 0.1179266 0.4947155 1.6709281 0.1513872 0.1719009 0.1777046 0.2476509 -0.1826303 0.007408 0.0477089 0.0137028 -1.0783788 -0.0526566 0.0200626 -0.0544041 -0.2803415 -0.0096937 -0.0054587 -0.0356825 -0.0843443 0.1017205 0.1218825 -0.0850769 0.0158244 0.2123006 -0.1373157 0.0054632 -0.0662118 0.004691 0.0651546 -0.0098002 -0.0676058 -0.0090652 0.1830558 0.0678761 -0.0028497 0.0190608 -0.074881 -0.0180329 -0.0611453 0.0185951 -0.0387321 0.0811176 0.0067831 0.0075758 0.0336738 0.0536131 0.0270896 0.0872204 0.0198174 0.0381913 -0.087167 0.1771561 -0.0057796 -0.0439758 -0.0147544 0.2616519 -0.0044873 -0.0422919 -0.0015972 0.3703066 0.1582819 -0.0612268 -0.0558814 -0.0419386 0.1977224 -0.0203269 -0.0536259 -0.0227814 0.3721091 0.1744665 0.0180845 -0.0412987 0.0209404 0.2522569 -0.0097886 -0.0394783 -0.0136057 0.3659047 0.1566053 0.0643336 -0.0458455 0.0487805 0.1958106 -0.0039242 -0.0435118 -0.0016469 0.3757203 0.124168 -0.1434779 0.0271757 -0.1159496 -0.0453132 -0.0529854 0.0495414 0.0040198 0.0737737 unknown
polarizability: 123.2479273|-4.4579598|120.8516329|-0.0209318|9.2148742|57.4992041 unknown
InChI: InChI=1S/C5H8N4S/c6-3-1-4(7)9-5(2-10)8-3/h1,10H,2,6-7H2
charge 0 multiplicity 1
18 atoms
S  3.343266 -0.516932 -0.835978
N  0.23429 1.292915 0.324288
N  0.248132 -1.136633 0.156274
N  -1.710245 2.537625 0.001997
N  -1.680956 -2.354593 -0.333956
C  0.841026 0.075516 0.361702
C  -1.117772 1.292312 0.036444
C  -1.099385 -1.119512 -0.129398
C  -1.83565 0.092913 -0.20406
C  2.319294 0.050949 0.664501
H  -2.904948 0.10042 -0.436295
H  2.675192 1.063767 0.896665
H  2.537968 -0.63919 1.493732
H  -1.117606 3.347099 0.173506
H  -2.696277 2.659681 -0.207973
H  -1.085388 -3.176826 -0.26566
H  -2.667997 -2.454546 -0.550526
H  2.668656 -1.720465 -0.971064
