program: Gaussian 09
title: 000237411
version: EM64L-G09RevD.01
frameworkgroup: C1[X(C9H10ClFO2)]
method: RPBEPBE
basis: SDD
operation: Freq
keyword: #p
keyword: freq=noraman
keyword: PBEPBE/SDD
title: #p freq=noraman PBEPBE/SDD
converged: YES YES NO NO
title: Mulliken charges:
elementType: Cl F O O C C C C C C C C C H H H H H H H H H H
charge: -0.096175 -0.198461 -0.304208 -0.271790 0.418858 0.073726 0.225001 0.114986 -0.321556 -0.348552 -0.756121 -0.516413 -0.494504 0.246884 0.259218 0.266769 0.286908 0.233922 0.224700 0.256619 0.230075 0.240792 0.229324
chargesum: 0.00000
title: Mulliken charges with hydrogens summed into heavy atoms:
elementType: Cl F O O C C C C C C C C C
charge: -0.096175 -0.198461 -0.304208 -0.271790 0.418858 0.073726 0.225001 0.114986 -0.074672 -0.089334 -0.202444 0.198828 0.205686
polarizability: 1.71401595e+02 -2.44110792e-01 1.17398757e+02 2.10068365e+00 -1.73587598e-01 7.22523186e+01
1716.lowfreq: -5.3190 -0.0015 0.0013 0.0016 4.8685 7.9481 33.7690 39.7258 52.4166
frequency: 33.7001 39.6426 52.3550 70.9278 106.3225 153.2229 157.2387 186.7133 215.8804 228.9681 277.3687 282.2705 334.7300 354.7365 373.8013 460.4759 490.9407 547.2378 560.3844 570.8616 610.3470 648.5840 720.9471 753.3724 822.2856 873.4671 895.0805 921.3074 943.8853 986.9684 1035.4781 1105.8452 1110.5448 1129.0862 1149.9329 1153.5410 1164.7776 1182.8856 1244.3572 1253.8885 1290.3344 1373.9318 1414.2360 1431.9926 1443.8584 1454.6750 1455.8667 1457.8368 1461.8682 1480.1757 1487.9700 1567.0938 1616.4288 2986.0921 2999.2182 3079.5573 3094.7969 3109.1987 3127.7180 3130.0425 3146.9670 3163.9789 3178.1015
redmass: 2.9520 6.7367 2.0237 7.5176 3.2952 1.5486 1.7562 3.6217 2.4289 3.4090 6.8214 3.5472 6.6809 5.1417 4.9536 5.7522 7.8295 5.7158 4.4903 5.6216 6.3920 4.5215 5.8751 7.3598 1.4894 3.6064 2.8150 3.8988 1.3325 6.0262 2.9841 1.2398 1.2344 1.2586 1.3940 1.4180 1.5790 2.8449 1.1925 1.9133 4.1617 7.4069 2.6353 1.3252 1.3943 1.0728 1.1047 1.0930 1.0524 1.0607 2.9976 7.8732 7.9657 1.0320 1.0293 1.0575 1.1014 1.1036 1.1058 1.1044 1.0896 1.1116 1.0959
irintensity: 6.3676 1.5670 5.4042 3.8748 2.4640 3.8563 0.8865 2.9634 3.4721 4.8242 2.9034 4.0400 12.0778 0.8997 1.5246 19.2275 11.9707 37.2590 33.2485 1.0496 9.3023 55.6943 7.5519 8.8036 37.5806 15.2138 16.1645 11.3464 0.7108 72.4964 141.6528 0.7511 3.3134 18.2131 16.9048 8.6267 16.9212 17.3787 72.6612 12.5873 225.2463 61.9752 79.1823 15.2739 24.1921 10.3840 14.0516 4.8240 36.3977 25.8105 71.8689 31.1581 100.2094 57.4886 70.2268 17.5011 28.6222 34.5804 25.2058 15.6352 4.5271 1.7407 4.0988
temp: 298.150 k
press: 1.00000 atm
elementType: 17 9 8 8 6 6 6 6 6 6 6 6 6 1 1 1 1 1 1 1 1 1 1
symmnumber: 1
zpe: 449534.5 jmol-1
zpe.correction: 0.171219 hartree
zpe.thermalcorrener: 0.185121 hartree
zpe.thermalcorrenthalpy: 0.186065 hartree
zpe.thermalcorrgfe: 0.128747 hartree
zpe.sumelectzpe: -1058.287239 hartree
zpe.sumelectthermal: -1058.273336 hartree
zpe.sumelectthermalent: -1058.272392 hartree
zpe.sumelectthermalfe: -1058.329710 hartree
dipole: -2.9290 -0.0219 0.8872
dipole: 3.0605
quadrupole: -82.0172 -76.4081 -83.5899
quadrupole: -6.5901 6.0252 -4.9141
quadrupole: -1.3455 4.2636 -2.9182 -6.5901 6.0252 -4.9141
hfenergy: -1058.4584574 hartree
pointgroup: C01 [X(C9H10Cl1F1O2)]
dipole: 1.1701931 0.0177105 -0.2831218 debye
dipolederiv: -0.8431405 0.0828357 0.0909589 0.1313895 -0.1957871 -0.0143533 0.5884463 -0.0812441 -0.354111 -0.2865595 0.174958 -0.0816472 0.1468584 -0.8537549 0.141306 -0.0614385 0.1074812 -0.1691987 -0.5120099 -0.321053 -0.1255391 -0.4361167 -1.2119144 -0.3067407 -0.0322467 -0.158028 -0.3736732 -1.8277078 0.0965613 -0.1365675 0.1148874 -0.2904391 0.0010505 -0.4316388 0.0735289 -0.3530929 -0.5308662 -0.004111 -0.0262377 0.0910452 -0.1963408 0.0144673 -0.2979596 0.0344666 -0.1735132 0.0702874 0.62264 0.165356 0.7666189 0.5807508 0.180714 -0.0472369 0.0888615 -0.0044054 1.4744302 -0.2212922 0.198457 -0.5145823 0.0857958 -0.0476987 0.4391784 -0.0908448 0.1214302 0.4683492 -0.2732884 0.0981588 -0.0205947 0.8196811 -0.1675418 0.1257021 -0.1277668 0.1082062 0.1890613 -0.0834025 0.0512027 -0.1300742 0.1089855 -0.0179093 0.0697317 -0.0523306 -0.1330695 -0.4796264 0.0658355 0.0053839 -0.2149278 0.0577162 -0.0498287 0.0114752 -0.0277444 -0.1498175 1.2061408 -0.114929 -0.1830281 -0.2275958 0.1593498 0.0407133 -0.4516793 0.0927787 0.4783809 0.1339073 -0.1368653 -0.0643207 0.1466312 0.6870652 0.2126374 0.0447177 0.2506319 0.4325365 0.9152169 0.0245199 0.001042 0.3719644 0.2557689 0.034018 -0.062157 -0.0027129 0.2915345 0.0095135 -0.0967894 -0.0317782 -0.074195 0.0098986 -0.0060556 -0.0245566 -0.0071093 0.1413788 0.0737335 0.053911 -0.0275409 0.0505217 -0.0267995 0.0161689 -0.0144451 0.0227747 0.1653492 -0.024961 -0.0057641 0.0179755 -0.0697143 -0.0018633 -0.1054448 0.0531541 -0.0658532 -0.0112922 0.021167 -0.0005636 0.0601667 0.0702126 0.0104194 0.0749344 0.0688004 0.0371157 -0.0008425 -0.0592714 -0.1408378 -0.027166 -0.095823 -0.0082546 -0.0491491 -0.0155935 -0.0571079 0.0883379 0.0894713 0.0420719 0.0884371 -0.0334869 -0.0164857 0.0874055 0.0192825 -0.0360037 -0.1359776 0.0239206 0.1665765 -0.0130789 0.0625228 0.0051491 -0.005198 -0.0512802 0.0258578 0.0394683 -0.139095 0.0854159 -0.0144051 0.137696 -0.0084414 0.0155386 -0.0108696 0.0201744 0.1144028 0.0280255 -0.0166387 0.0101348 -0.155999 -0.0344815 -0.1070986 0.0067974 -0.1078221 -0.0112036 0.0000133 0.0002093 -0.0559642 -0.1172384 0.0639818 0.0580643 0.0738158 0.0608964 -0.1108279 unknown
polarizability: 170.8497608|-0.5882324|116.9349051|7.6522912|4.5253249|73.2680044 unknown
InChI: InChI=1S/C9H10ClFO2/c1-12-7-4-3-6(5-10)8(11)9(7)13-2/h3-4H,5H2,1-2H3
charge 0 multiplicity 1
23 atoms
Cl -4.121549 -0.003545 0.804038
F  -1.06157 1.846279 -0.457736
O  1.61824 1.371465 0.328544
O  2.427401 -1.428903 0.701776
C  -1.589728 -0.515862 -0.379689
C  0.704594 0.316612 0.163794
C  1.143584 -1.033637 0.33339
C  -0.641985 0.516349 -0.221959
C  -1.125803 -1.839934 -0.160392
C  0.213134 -2.094471 0.17487
C  -3.001757 -0.221135 -0.756864
C  1.220099 2.46038 1.253822
C  3.60939 -0.60816 0.361073
H  -1.83041 -2.67186 -0.261955
H  0.579589 -3.113085 0.328513
H  -3.479197 -1.049459 -1.297286
H  -3.123068 0.730464 -1.289708
H  2.12535 3.075247 1.369731
H  0.913087 2.044599 2.231615
H  0.402955 3.062865 0.825303
H  4.459038 -1.298356 0.480423
H  3.705764 0.252051 1.040852
H  3.550239 -0.244501 -0.679357
