program: Gaussian 09
title: 000237396
version: EM64L-G09RevD.01
frameworkgroup: C1[X(C11H11NO)]
method: RPBEPBE
basis: SDD
operation: Freq
keyword: #p
keyword: freq=noraman
keyword: PBEPBE/SDD
title: #p freq=noraman PBEPBE/SDD
converged: NO YES NO YES
title: Mulliken charges:
elementType: O N C C C C C C C C C C C H H H H H H H H H H H
charge: -0.276642 -0.468097 0.190029 0.257143 0.136258 0.233041 0.040872 -0.360076 -0.390208 -0.815098 -0.772154 -0.260291 -0.208345 0.300706 0.280598 0.226594 0.285057 0.214042 0.213928 0.252973 0.205586 0.252981 0.231981 0.229122
chargesum: 0.00000
title: Mulliken charges with hydrogens summed into heavy atoms:
elementType: O N C C C C C C C C C C C
charge: -0.276642 -0.167392 0.190029 0.257143 0.136258 0.233041 0.040872 -0.079478 -0.163614 -0.102072 -0.060613 -0.028310 0.020777
polarizability: 1.84897793e+02 -1.48422020e+00 1.45855784e+02 -1.25311476e-03 -3.78101018e-04 5.98165048e+01
1716.lowfreq: -0.0007 -0.0005 0.0004 2.7794 4.9834 8.9140 47.8345 87.0417 114.4001
frequency: 47.7514 87.0370 114.3905 121.2029 156.9473 250.4036 280.4117 286.4805 308.6909 338.7157 419.9546 436.6935 437.1065 533.5409 540.7502 585.3905 592.4373 596.2347 647.2730 685.6569 691.9625 767.6583 793.8140 861.6849 869.2029 873.5823 964.8681 986.6196 1001.8655 1002.8956 1023.3555 1030.7511 1050.9992 1096.1495 1127.3475 1169.2456 1190.9100 1256.0622 1276.4839 1286.6764 1339.9488 1388.1544 1405.3322 1408.6069 1428.7166 1455.1845 1460.7181 1471.7591 1477.6052 1489.2143 1514.5476 1535.4552 1592.8010 1612.7140 1631.0992 2965.4966 2982.9399 3037.4798 3071.5476 3079.1023 3092.0915 3114.0094 3138.1733 3152.5127 3168.1539 3547.1748
redmass: 1.0328 3.5139 1.2041 2.6271 4.5245 3.8775 3.9216 2.4970 3.9038 5.1298 5.7372 6.0724 3.2768 3.2846 7.5508 2.0887 4.1210 1.5920 5.6507 5.4265 3.5660 1.5951 2.9596 4.2178 3.9541 1.5290 1.3621 2.5767 1.3290 1.5266 1.4060 1.8774 1.5362 2.2812 2.4559 1.0814 2.1532 2.8822 2.6251 2.0129 2.3386 1.3455 2.0491 2.0880 2.2924 1.0443 1.0788 2.3808 1.2138 1.0477 4.0104 7.0640 4.1488 8.0173 5.9819 1.0378 1.0368 1.0977 1.0978 1.0998 1.0969 1.0883 1.0885 1.0933 1.0999 1.0772
irintensity: 0.2077 3.7239 0.0464 0.1232 0.0351 2.0034 0.0757 0.4132 1.8265 12.5310 8.3268 0.0798 2.1941 9.5683 2.7825 44.2728 0.2744 26.8127 0.9352 1.4091 13.8482 95.3634 5.8713 0.4434 2.9054 0.1178 2.7196 21.6272 0.7833 19.7310 5.9625 0.9330 0.7149 5.7095 15.2846 4.4427 19.4675 17.8200 3.8476 1.8585 1.1038 52.0684 13.3316 33.2237 5.1615 11.3254 20.2125 64.7173 9.7510 25.3432 111.9700 159.8620 7.4195 98.4927 92.4453 54.1944 21.7863 30.9786 7.5520 20.5188 2.0652 8.4840 12.2216 8.0432 27.4020 38.2800
temp: 298.150 k
press: 1.00000 atm
elementType: 8 7 6 6 6 6 6 6 6 6 6 6 6 1 1 1 1 1 1 1 1 1 1 1
symmnumber: 1
zpe: 504523.5 jmol-1
zpe.correction: 0.192163 hartree
zpe.thermalcorrener: 0.203689 hartree
zpe.thermalcorrenthalpy: 0.204633 hartree
zpe.thermalcorrgfe: 0.154573 hartree
zpe.sumelectzpe: -554.851061 hartree
zpe.sumelectthermal: -554.839534 hartree
zpe.sumelectthermalent: -554.838590 hartree
zpe.sumelectthermalfe: -554.888651 hartree
dipole: -0.3709 -6.4992 -0.0003
dipole: 6.5098
quadrupole: -62.9663 -76.0553 -80.0564
quadrupole: 5.2227 0.0011 -0.0007
quadrupole: 10.0597 -3.0293 -7.0304 5.2227 0.0011 -0.0007
hfenergy: -555.0432235 hartree
pointgroup: C01 [X(C11H11N1O1)]
dipole: 0.1194752 2.5579654 0.0444968 debye
dipolederiv: -0.537192 0.0140547 0.0046616 0.1560178 -1.2326928 -0.0202511 0.0073422 -0.0163299 -0.3640876 -1.0978063 0.233617 0.0256748 -0.1440998 -0.5885582 -0.0025914 0.0186174 -0.0122106 -0.2584858 -0.3261035 0.2996834 0.0134396 -0.0493494 -0.2197107 -0.0025211 0.0069332 -0.0113764 -0.0173704 0.6889955 0.2008281 -0.0114535 0.4152527 0.1381462 -0.0095083 -0.0074165 -0.0040992 0.087476 0.0061087 -0.5324097 -0.0134244 -0.1815562 -0.6781049 -0.0055229 -0.0066848 0.0032572 -0.134668 0.7004398 -0.2885165 -0.022442 -0.0621896 0.8360059 0.0166324 -0.0183962 0.0222061 0.0320231 0.6956684 0.172706 -0.0111033 -0.1761378 1.2823199 0.0259662 -0.0176904 0.0169365 0.130836 0.0658807 -0.1506342 -0.0071659 0.1216143 0.0609908 0.0000141 -0.0020334 0.0068918 -0.1050191 -0.268873 -0.151884 -0.0011835 -0.0065146 0.0789599 0.0053937 0.0015687 0.0090159 -0.2028261 -0.1374164 0.0649638 0.0071478 -0.0571877 -0.0033132 -0.0005395 0.0046428 -0.0036015 0.0992937 -0.163976 -0.1318397 0.0027318 -0.1080164 0.0477612 0.0029287 0.0033124 0.0036397 0.0402039 -0.0500335 0.2126888 0.0004895 0.1275283 -0.1403464 -0.0024043 -0.0011246 -0.0045581 -0.1864201 0.0887476 0.0165453 -0.0054868 -0.0658132 0.1951388 0.0079496 -0.00709 0.0058873 -0.1384965 0.1599583 0.0315885 0.0041006 0.0075536 0.164404 -0.00269 0.0036902 -0.0032239 0.2985084 0.1298746 0.0407838 0.0013236 -0.0412432 0.0002232 -0.0017829 -0.0002091 -0.0038433 0.1518122 0.0719165 -0.047526 0.0016353 0.0155467 -0.1260612 -0.0059231 0.0027806 -0.0043011 0.1710935 0.1907967 -0.0882375 -0.0035884 0.0780879 -0.0339039 -0.0049914 -0.0003973 -0.0007366 0.1172473 -0.0637034 0.0160221 -0.0878676 -0.0262559 0.081294 -0.0803413 -0.1411264 -0.0316584 -0.0556551 -0.0523442 0.0142068 0.0884516 -0.0276904 0.0767177 0.0871422 0.140117 0.0363271 -0.0624579 0.0066635 -0.0281045 -0.0793756 0.0089104 0.0648489 0.0622931 -0.1123003 0.0033736 -0.0142571 0.0473576 0.1273305 0.0041554 0.0109204 -0.1485018 -0.0052639 0.0019681 -0.008232 0.11573 0.0163898 -0.0311253 0.0766177 0.0015621 0.0671069 -0.0593299 0.110816 0.0013581 -0.0263542 -0.0847452 -0.086908 0.0047456 -0.0950823 0.0316898 -0.0000864 0.0046288 -0.0002809 0.1656982 -0.0866044 0.0921666 0.0079162 0.0981423 0.0455858 -0.0045727 0.0080516 -0.0044413 0.1561755 unknown
polarizability: 184.8439545|-1.0213237|145.7984596|-3.1885116|1.6279571|59.9276675 unknown
InChI: InChI=1S/C11H11NO/c1-7-8(2)12-10-6-4-3-5-9(10)11(7)13/h3-6,12H,1-2H3
charge 0 multiplicity 1
24 atoms
O  0.705715 -2.543558 -0.060534
N  0.460863 1.591319 0.022695
C  -0.674307 -0.555878 0.011193
C  -0.737341 0.869189 0.039525
C  1.834445 -0.404738 -0.049519
C  1.712998 0.981611 -0.020493
C  0.636136 -1.262483 -0.03534
C  -1.888786 -1.292395 0.028287
C  -1.992236 1.538351 0.083845
C  3.188965 -1.078085 -0.096231
C  2.90774 1.911468 -0.033713
C  -3.129664 -0.637279 0.07202
C  -3.177233 0.785582 0.099859
H  0.414306 2.611324 0.042807
H  -1.808543 -2.384357 0.005936
H  -2.029772 2.6350 0.105174
H  3.031074 -2.169096 -0.113738
H  3.81112 -0.829722 0.785685
H  3.767167 -0.794778 -0.99729
H  3.564492 1.719514 0.833791
H  2.608212 2.974857 -0.006034
H  3.518755 1.752849 -0.94051
H  -4.060306 -1.214043 0.084939
H  -4.144096 1.299848 0.13415
