program: Gaussian 09
title: 000237397
version: EM64L-G09RevD.01
frameworkgroup: C1[X(C12H18ClNO)]
method: RPBEPBE
basis: SDD
operation: Freq
keyword: #p
keyword: freq=noraman
keyword: PBEPBE/SDD
title: #p freq=noraman PBEPBE/SDD
converged: YES YES NO NO
title: Mulliken charges:
elementType: Cl O N C C C C C C C C C C C C H H H H H H H H H H H H H H H H H H
charge: -0.069867 -0.473084 -0.180699 -0.433489 -0.184672 -0.303634 -0.327043 0.466440 -0.676804 -0.669926 -0.410432 -0.393535 -0.217175 -0.206215 -0.104310 0.217031 0.239266 0.194863 0.202224 0.214382 0.202553 0.210409 0.229597 0.210249 0.215956 0.224254 0.222767 0.215367 0.233435 0.289269 0.359017 0.251740 0.252064
chargesum: 0.00000
title: Mulliken charges with hydrogens summed into heavy atoms:
elementType: Cl O N C C C C C C C C C C C C
charge: -0.069867 -0.114067 -0.180699 0.022808 0.010191 0.112972 0.085919 0.466440 -0.021002 -0.007538 -0.176997 -0.104266 0.034565 0.045849 -0.104310
polarizability: 2.14097257e+02 8.12671973e+00 1.30622537e+02 -7.77846770e+00 1.51759797e+01 1.08298391e+02
1716.lowfreq: -8.1483 -4.0537 0.0020 0.0021 0.0024 11.1093 28.4863 29.6555 47.1481
frequency: 28.3755 29.2297 47.0795 65.7947 80.2697 84.4286 138.3037 162.3502 176.7092 223.1598 238.9289 270.7874 279.2966 295.6271 318.6769 366.8110 378.5155 409.9243 438.5887 453.2411 474.8436 513.9854 552.5498 624.6351 654.9028 711.6597 743.9577 755.1344 793.7998 795.9114 810.8138 829.9279 847.3793 882.9628 915.2190 947.1013 981.1091 989.0086 999.9448 1021.7998 1041.4796 1062.6852 1068.6346 1074.4556 1088.2553 1100.1274 1113.3989 1155.8152 1173.1377 1197.6880 1208.0675 1240.4770 1262.8527 1278.0229 1285.1876 1289.5800 1303.2348 1342.1456 1362.6624 1367.5057 1381.7650 1389.9420 1390.2546 1395.5148 1399.1442 1452.3790 1465.7390 1471.6177 1476.1436 1477.6430 1479.3199 1485.9921 1490.6960 1587.8488 1601.1812 2896.1953 2902.5244 2905.8425 2940.7666 2985.3483 2987.3542 3027.0680 3043.1975 3064.2868 3079.3622 3083.2959 3090.7699 3091.5777 3120.1339 3157.5378 3162.0410 3168.5150 3177.7636
redmass: 4.0770 3.9372 4.4873 3.8092 2.7028 2.1311 4.7281 1.8783 5.8154 1.3511 1.5301 3.7166 4.9978 1.9654 3.4885 5.1413 2.5575 2.9432 2.8733 3.6699 3.5108 3.3023 2.7444 7.0392 4.9886 3.5252 2.7221 1.1529 1.3466 1.1436 1.6979 1.5803 1.5389 2.5814 2.0936 1.3566 1.4535 2.0341 4.0721 3.1910 2.9731 2.5014 2.6787 2.0017 2.0681 1.4868 1.6941 1.6003 1.1324 2.3192 2.4873 1.5649 1.2154 1.1557 1.1913 1.2188 1.2567 1.2870 1.3296 1.4792 4.9185 1.6357 1.6734 1.2366 1.5476 1.0935 1.0517 1.0524 2.2277 1.0809 1.0726 1.0735 1.0798 7.5597 6.3558 1.0706 1.0711 1.0826 1.0683 1.0358 1.0359 1.0900 1.0892 1.0943 1.0986 1.0983 1.1007 1.1005 1.0897 1.0888 1.0630 1.0949 1.0964
irintensity: 0.2147 0.1777 0.5028 2.2204 0.6908 0.0376 1.7197 0.1056 0.9821 0.4068 1.0193 7.2890 1.5243 0.4435 1.7289 2.7315 6.0989 0.0354 2.5344 19.0115 12.7836 12.2853 16.7771 0.3018 13.1157 2.9227 12.9638 75.2607 8.2320 7.8713 57.7575 4.9247 31.4788 11.7197 4.2746 0.1301 0.3365 6.4080 49.7311 24.1290 49.8843 59.7924 23.1654 15.4921 3.9756 9.4273 15.4406 24.8049 2.7352 38.9611 14.6461 21.8804 11.2748 7.9353 2.0972 18.6025 17.8588 4.5405 0.7197 16.6505 3.6248 21.4316 31.8763 15.5550 57.5483 6.8967 5.5599 4.1069 57.6541 23.0601 16.9057 11.1678 17.5970 3.0272 3.8267 29.2614 131.8861 51.4791 64.6900 28.3620 20.3847 13.4057 16.3977 17.2695 42.4170 55.7995 46.4094 37.6348 13.6526 2.1952 260.2073 5.7229 1.3860
temp: 298.150 k
press: 1.00000 atm
elementType: 17 8 7 6 6 6 6 6 6 6 6 6 6 6 6 1 1 1 1 1 1 1 1 1 1 1 1 1 1 1 1 1 1
symmnumber: 1
zpe: 724798.9 jmol-1
zpe.correction: 0.276061 hartree
zpe.thermalcorrener: 0.292330 hartree
zpe.thermalcorrenthalpy: 0.293274 hartree
zpe.thermalcorrgfe: 0.230351 hartree
zpe.sumelectzpe: -1056.929797 hartree
zpe.sumelectthermal: -1056.913528 hartree
zpe.sumelectthermalent: -1056.912584 hartree
zpe.sumelectthermalfe: -1056.975507 hartree
dipole: -4.7645 -0.7354 -2.5764
dipole: 5.4662
quadrupole: -100.3673 -91.7453 -103.1342
quadrupole: 0.1427 3.9516 3.1776
quadrupole: -1.9517 6.6703 -4.7186 0.1427 3.9516 3.1776
hfenergy: -1057.2058579 hartree
pointgroup: C01 [X(C12H18Cl1N1O1)]
dipole: 1.8699919 0.2481065 -1.0327009 debye
polarizability: 212.7922201|13.8229845|127.3341059|8.1085908|-17.1670849|112.8918596 unknown
InChI: InChI=1S/C12H18ClNO/c1-3-14(4-2)9-12(15)10-5-7-11(13)8-6-10/h5-8,12,15H,3-4,9H2,1-2H3
charge 0 multiplicity 1
33 atoms
Cl -5.532973 -0.637977 -0.384293
O  0.954282 0.033485 1.662175
N  2.709856 0.028458 -0.33993
C  1.279324 0.078411 -0.748598
C  0.436877 0.646562 0.446535
C  3.420599 1.322174 -0.570957
C  3.443902 -1.159583 -0.869946
C  -1.043666 0.347077 0.27501
C  4.619104 1.530371 0.372957
C  3.079137 -2.463324 -0.136428
C  -1.817843 1.098019 -0.644852
C  -1.660475 -0.699216 1.001714
C  -3.183483 0.803579 -0.855459
C  -3.026522 -1.005366 0.807103
C  -3.76438 -0.250596 -0.124493
H  1.113319 0.680659 -1.668977
H  0.933559 -0.950203 -0.949069
H  0.578761 1.751191 0.488766
H  3.749321 1.405501 -1.634571
H  2.690282 2.13508 -0.400542
H  3.26982 -1.274969 -1.966209
H  4.524085 -0.968297 -0.740072
H  4.288086 1.50237 1.425928
H  5.395184 0.755665 0.237349
H  5.091541 2.511177 0.180383
H  3.31474 -2.380378 0.939124
H  2.005424 -2.705162 -0.229153
H  3.651576 -3.310261 -0.557413
H  -1.36269 1.928074 -1.199576
H  -1.060062 -1.249838 1.73133
H  1.92575 -0.131864 1.41935
H  -3.782222 1.383127 -1.564024
H  -3.507213 -1.808847 1.373138
