program: Gaussian 09
title: 000237403
version: EM64L-G09RevD.01
frameworkgroup: C1[X(C17H14BrNO)]
method: RPBEPBE
basis: SDD
operation: Freq
keyword: #p
keyword: freq=noraman
keyword: PBEPBE/SDD
title: #p freq=noraman PBEPBE/SDD
converged: YES YES NO NO
title: Mulliken charges:
elementType: Br O N C C C C C C C C C C C C C C C C C H H H H H H H H H H H H H H
charge: -0.024548 -0.458817 -0.052454 0.376060 0.251445 -0.182557 -0.106065 -0.429956 0.031396 -0.387574 0.338068 -0.725045 -0.321162 -0.270327 -0.230674 -0.368813 -0.372228 -0.231468 -0.250720 -0.237892 0.245469 0.276727 0.230453 0.308353 0.311028 0.265425 0.231764 0.234804 0.279835 0.226260 0.360439 0.226875 0.226519 0.229381
chargesum: 0.00000
title: Mulliken charges with hydrogens summed into heavy atoms:
elementType: Br O N C C C C C C C C C C C C C C C C C
charge: -0.024548 -0.098379 -0.052454 0.376060 0.251445 0.062912 -0.106065 -0.153230 0.031396 -0.157121 0.338068 -0.105663 -0.055737 -0.038563 0.004130 -0.088977 -0.145969 -0.004593 -0.024202 -0.008511
polarizability: 3.25480179e+02 -4.30841644e+01 2.73339356e+02 -1.82309081e+01 -1.52938156e+01 9.72737200e+01
1716.lowfreq: -6.9149 -3.3135 -0.0008 -0.0007 -0.0004 3.7368 20.4959 28.9922 54.2995
frequency: 20.4545 28.9053 54.2951 68.0271 81.6267 103.1972 147.9247 168.1309 179.0960 186.4106 232.5247 275.3550 289.9073 315.2061 359.1899 388.5347 401.2919 419.4978 456.8834 466.2682 506.4934 517.2200 539.2681 564.3932 571.9658 608.5061 616.9313 651.3746 684.0769 687.9381 697.9193 758.3310 773.9430 783.8047 798.1558 826.3980 853.0690 854.8764 878.8530 888.3956 926.2253 938.8498 961.2683 965.2399 987.1209 989.4508 996.4772 1007.8881 1012.3232 1025.1526 1027.6851 1053.0652 1066.1674 1085.9257 1134.6989 1136.7636 1169.2911 1171.8596 1186.6800 1199.4458 1214.2538 1229.0706 1259.0897 1283.0589 1296.7475 1306.6979 1326.9701 1360.3007 1376.1003 1383.8633 1390.5006 1413.8162 1426.3874 1440.2175 1449.9048 1487.9848 1509.9983 1540.9054 1586.0515 1594.7976 1610.7110 1621.7920 2970.2480 3065.6785 3122.8690 3125.2325 3135.0767 3138.5523 3148.6725 3155.6204 3158.4869 3160.6695 3170.8252 3171.3676 3193.4910 3526.5064
redmass: 3.8398 8.7661 6.5883 4.8537 4.4750 4.9621 5.3269 6.7385 4.3256 4.8695 4.5467 5.3619 5.9478 5.7408 2.8888 1.3198 2.8098 3.4254 3.0596 3.3783 5.4267 6.8859 3.4556 7.6580 4.3548 5.5639 6.3201 5.7313 3.3130 5.2442 1.6873 3.7116 1.5052 2.2986 2.5127 2.3452 4.5817 1.3282 1.6662 4.6125 1.5420 1.4673 2.0040 1.4857 1.4791 4.5934 1.3296 1.3441 3.2817 2.3683 2.1769 5.1118 2.5118 1.6732 1.3329 1.4306 1.1394 1.0697 1.1911 1.2251 1.2717 1.4503 1.6765 2.2016 1.8677 1.6465 1.6110 3.3445 1.8504 4.4530 4.3795 2.6318 1.1408 2.4770 2.8375 2.6146 3.6091 7.1305 6.5128 6.7789 6.0359 6.4058 1.0837 1.0562 1.0864 1.0847 1.0885 1.0891 1.0934 1.0949 1.1111 1.0967 1.0986 1.0996 1.0905 1.0654
irintensity: 0.0042 0.2617 0.4057 1.3551 0.5634 2.0290 0.5456 1.9501 6.9915 2.7814 0.6788 4.7770 0.2774 1.2265 30.5872 130.1286 0.1739 1.0645 11.7503 1.0287 58.3516 3.8444 8.5568 4.4222 9.4945 18.8335 1.0446 2.8459 12.2748 19.7022 63.5530 1.3259 71.2391 36.7816 31.8220 1.8105 1.7596 0.9434 2.0679 16.6458 16.7110 3.2073 17.3587 4.4966 0.5980 0.1732 0.3855 1.7594 8.5094 9.2025 9.8533 42.7114 2.7276 12.9976 6.0854 38.0225 5.1103 2.0508 6.8734 25.4710 21.2156 9.5171 11.3716 4.4911 18.1401 15.3871 7.6503 58.4913 26.8033 14.8502 3.0866 16.9194 15.5017 27.2512 6.1620 5.7320 24.7331 47.7669 18.0546 81.7887 1.0695 3.3842 22.9825 5.5404 8.4855 1.5991 8.3500 13.3670 34.2936 22.7190 2.7937 22.3392 25.8587 21.1699 0.4757 14.0234
temp: 298.150 k
press: 1.00000 atm
elementType: 35 8 7 6 6 6 6 6 6 6 6 6 6 6 6 6 6 6 6 6 1 1 1 1 1 1 1 1 1 1 1 1 1 1
symmnumber: 1
zpe: 688443.3 jmol-1
zpe.correction: 0.262214 hartree
zpe.thermalcorrener: 0.279195 hartree
zpe.thermalcorrenthalpy: 0.280140 hartree
zpe.thermalcorrgfe: 0.214822 hartree
zpe.sumelectzpe: -798.264589 hartree
zpe.sumelectthermal: -798.247608 hartree
zpe.sumelectthermalent: -798.246663 hartree
zpe.sumelectthermalfe: -798.311981 hartree
dipole: -0.9539 0.5606 -0.3444
dipole: 1.1588
quadrupole: -120.6807 -111.6755 -131.3211
quadrupole: -7.8147 -4.9959 -2.6128
quadrupole: 0.5451 9.5503 -10.0953 -7.8147 -4.9959 -2.6128
hfenergy: -798.5268028 hartree
pointgroup: C01 [X(C17H14Br1N1O1)]
dipole: 0.427807 -0.0272421 -0.1552178 debye
polarizability: 348.9192225|-11.1275412|236.7169263|1.8681014|48.6005556|110.4571067 unknown
InChI: InChI=1S/C17H14BrNO/c18-11-17(20)14-10-16(12-6-2-1-3-7-12)19-15-9-5-4-8-13(14)15/h1-10,17,20H,11H2
charge 0 multiplicity 1
34 atoms
Br 4.162532 3.838139 0.13804
O  1.412314 2.743695 1.638719
N  -0.543719 -1.390824 -0.442422
C  1.258878 0.637159 0.455684
C  1.785135 -0.637115 0.02782
C  2.193166 1.766845 0.882482
C  0.819922 -1.622225 -0.423843
C  -0.1188 0.843863 0.435557
C  -1.011475 -0.192618 -0.013143
C  3.175663 -0.984789 0.024079
C  -2.49027 0.008592 -0.042156
C  2.80023 2.407538 -0.382258
C  1.28175 -2.903009 -0.870775
C  3.59652 -2.244013 -0.413978
C  2.643852 -3.209226 -0.868876
C  -3.312784 -0.95328 -0.692196
C  -3.113194 1.133756 0.564946
C  -4.711174 -0.79103 -0.741599
C  -4.514613 1.293979 0.517594
C  -5.32076 0.335232 -0.137847
H  3.012588 1.365281 1.514196
H  -0.49679 1.810228 0.771839
H  3.924159 -0.26719 0.379812
H  3.36079 1.69503 -1.003677
H  2.036463 2.940148 -0.968207
H  0.526382 -3.620741 -1.204738
H  4.662174 -2.497449 -0.405072
H  2.988622 -4.191208 -1.210424
H  -2.824102 -1.819602 -1.147429
H  -2.516309 1.884439 1.092941
H  2.00079 3.515748 1.847772
H  -5.328133 -1.540529 -1.249972
H  -4.977195 2.164825 0.995315
H  -6.40851 0.462151 -0.175382
