program: Gaussian 09
title: 000237417
version: EM64L-G09RevD.01
frameworkgroup: C1[X(C11H17N4O6P)]
method: RPBEPBE
basis: SDD
operation: Freq
keyword: #p
keyword: freq=noraman
keyword: PBEPBE/SDD
title: #p freq=noraman PBEPBE/SDD
converged: YES YES NO NO
title: Mulliken charges:
elementType: P O O O O O O N N N N C C C C C C C C C C C H H H H H H H H H H H H H H H H H
charge: 1.385408 -0.520338 -0.285524 -0.266427 -0.686573 -0.675082 -0.584717 -0.149969 -0.147724 -0.225876 -0.089707 -0.380026 -0.386937 0.144963 0.062841 -0.362188 0.191918 -0.215921 -0.271863 0.209821 -0.610012 -0.602145 0.213322 0.257452 0.208543 0.256440 0.227770 0.217207 0.268825 0.242343 0.235271 0.270840 0.248046 0.248761 0.266923 0.251576 0.252028 0.404526 0.396207
chargesum: 0.00000
title: Mulliken charges with hydrogens summed into heavy atoms:
elementType: P O O O O O O N N N N C C C C C C C C C C C
charge: 1.385408 -0.520338 -0.285524 -0.266427 -0.282048 -0.278875 -0.584717 -0.149969 -0.147724 -0.225876 -0.089707 0.090748 0.078046 0.144963 0.062841 0.082788 0.191918 0.052903 0.205751 0.209821 0.157635 0.168382
polarizability: 2.49244703e+02 -3.66822899e+00 1.99544052e+02 -2.76828982e+01 -4.92256640e+00 1.30786471e+02
1716.lowfreq: 0.0004 0.0007 0.0012 0.8167 2.4276 5.6533 14.3161 16.8176 25.0175
frequency: 13.1465 16.7868 24.9881 39.7773 65.2998 77.3243 80.5882 92.0440 102.3231 110.8297 118.0740 132.5360 139.6712 140.8575 158.5862 169.3843 200.2793 229.0507 242.9923 286.0783 288.7578 293.7472 317.6015 323.2757 348.8311 350.9736 375.2636 377.0328 381.5222 397.7148 429.8052 436.3963 450.5822 488.3162 538.8237 612.1220 635.8697 643.6041 669.7377 704.9155 723.2632 740.2991 743.6111 749.0685 754.5428 782.7185 799.8483 808.2861 906.9770 924.6063 937.5457 958.2255 1002.6616 1007.2545 1015.7352 1035.5489 1047.9839 1051.3877 1086.9022 1102.4109 1105.7062 1130.2819 1132.4587 1155.2779 1167.2633 1194.3768 1220.3457 1227.0457 1247.8310 1258.3291 1265.1530 1284.9026 1296.0905 1300.8228 1332.6695 1348.1337 1365.9171 1373.5593 1376.0899 1411.9902 1425.0447 1428.4478 1459.1089 1469.4814 1473.3671 1475.2453 1478.0140 1478.3869 1480.3889 1489.5063 1505.5369 1570.8651 1613.1757 1645.1093 2989.1572 2995.5123 3003.6878 3009.3272 3013.1348 3015.9700 3042.6433 3058.8827 3081.4069 3090.3811 3099.1340 3104.8895 3139.7952 3141.0487 3239.0804 3593.1547 3615.3207
redmass: 6.2406 7.0004 6.5050 5.5432 6.3982 1.8825 1.0904 3.3421 3.8810 2.3620 1.4843 2.3929 3.8317 4.0578 5.1281 1.8524 3.1789 4.0238 3.5081 3.0224 2.7364 4.9264 4.7114 4.1419 4.2077 4.2913 3.8663 6.0084 2.4334 6.9360 7.1391 6.4800 4.5164 6.5805 5.9617 4.4519 9.8132 6.7947 8.7538 10.7928 10.4866 5.7870 6.8607 3.8516 1.2767 5.4288 1.2005 1.4908 2.9787 1.4299 8.2418 6.2451 1.3659 2.9016 1.2317 4.0821 3.5458 3.2460 4.7076 3.1529 1.9706 1.3018 1.3014 1.3538 2.0554 3.2777 2.4306 2.2074 1.8709 1.2496 4.3649 1.2205 1.2370 5.4892 1.3365 2.6575 1.4508 2.6953 1.4464 1.6128 1.4695 1.4850 1.4403 1.0767 1.0500 1.1560 1.0430 1.0751 1.1226 1.0917 2.6357 8.1831 10.8441 9.9441 1.0602 1.0592 1.0571 1.0335 1.0329 1.0604 1.0990 1.1034 1.1084 1.1069 1.1025 1.1021 1.1024 1.1014 1.0988 1.0662 1.0665
irintensity: 2.0821 2.2193 0.1319 0.0972 0.8983 0.3455 0.0821 0.0107 1.3446 3.5890 0.9871 6.7573 21.1754 8.0319 8.3241 67.4140 11.3190 1.7148 38.1420 3.8180 30.5182 2.5505 37.7009 12.7738 29.2999 24.7593 44.4264 45.5151 67.4914 22.0479 5.2944 15.7685 9.4192 15.5097 1.2715 13.4261 18.8785 15.1941 0.0585 8.9522 238.9266 101.1020 106.0737 12.4253 8.4418 0.8142 0.2735 21.6526 3.3049 1.6496 223.1232 21.1900 27.9027 81.9057 128.3860 23.1403 4.8777 14.6032 177.3688 57.1368 12.7855 0.3629 0.1244 1.0995 55.0614 30.0955 36.9197 15.3820 11.5631 12.3388 35.6493 7.3489 12.3336 24.0123 2.5260 27.3317 44.8802 12.1816 6.0490 28.2673 60.0441 106.4660 92.5465 1.7795 18.1272 10.6889 15.9600 13.6747 20.7605 21.2634 116.7082 7.1053 701.4048 334.5738 6.1752 3.8698 38.9465 36.3072 25.8277 39.3879 0.8938 1.6124 7.7759 42.8877 16.7252 16.4129 0.8034 0.4404 1.4603 64.4806 68.2594
temp: 298.150 k
press: 1.00000 atm
elementType: 15 8 8 8 8 8 8 7 7 7 7 6 6 6 6 6 6 6 6 6 6 6 1 1 1 1 1 1 1 1 1 1 1 1 1 1 1 1 1
symmnumber: 1
zpe: 772206.4 jmol-1
zpe.correction: 0.294118 hartree
zpe.thermalcorrener: 0.318128 hartree
zpe.thermalcorrenthalpy: 0.319072 hartree
zpe.thermalcorrgfe: 0.236933 hartree
zpe.sumelectzpe: -1439.298409 hartree
zpe.sumelectthermal: -1439.274399 hartree
zpe.sumelectthermalent: -1439.273455 hartree
zpe.sumelectthermalfe: -1439.355594 hartree
dipole: -0.0393 -0.7723 1.3734
dipole: 1.5761
quadrupole: -172.0320 -131.2295 -133.9653
quadrupole: 19.6785 17.3899 -0.0421
quadrupole: -26.2897 14.5127 11.7770 19.6785 17.3899 -0.0421
hfenergy: -1439.592527 hartree
pointgroup: C01 [X(C11H17N4O6P1)]
dipole: 0.0098223 0.3991968 0.4744093 debye
polarizability: 249.6777109|2.7678346|199.0818074|26.9035461|-7.2703002|130.815709 unknown
InChI: InChI=1S/C11H17N4O6P/c1-13-9-8(10(16)14(2)11(13)17)15(7-12-9)5-3-4-6-21-22(18,19)20/h7,18-19H,3-6H2,1-2H3
charge 0 multiplicity 1
39 atoms
P  -6.391046 -0.443125 0.371358
O  -5.01437 0.124891 -0.452394
O  0.841352 -1.667714 -0.773533
O  5.214484 -1.631416 0.994206
O  -6.25336 0.455245 1.827523
O  -5.997968 -2.012415 1.006197
O  -7.724279 -0.381991 -0.474124
N  1.089286 1.451026 -0.823506
N  4.236784 0.447521 0.513432
N  3.040874 -1.616038 0.114662
N  2.991158 2.499685 -0.093543
C  -0.282259 1.256098 -1.340621
C  -1.284283 0.856683 -0.235643
C  1.97423 0.444182 -0.400802
C  3.126259 1.123582 0.033323
C  -2.701878 0.676897 -0.82648
C  1.850352 -0.99099 -0.394374
C  1.743707 2.653396 -0.613989
C  -3.694416 0.231172 0.246302
C  4.228643 -0.966218 0.568353
C  5.430944 1.191672 0.960639
C  3.068432 -3.095673 0.183328
H  -0.589483 2.202201 -1.822845
H  -0.251517 0.464848 -2.109544
H  -1.291298 1.631376 0.55614
H  -0.942215 -0.092472 0.216371
H  -2.683176 -0.080521 -1.632513
H  -3.062391 1.624046 -1.271354
H  1.292311 3.613648 -0.852569
H  -3.790021 0.968036 1.063748
H  -3.427001 -0.755995 0.668631
H  6.175203 0.455141 1.295941
H  5.164701 1.870552 1.787771
H  5.834947 1.792048 0.128556
H  2.09461 -3.458898 -0.175614
H  3.247256 -3.421422 1.22084
H  3.883376 -3.488468 -0.446379
H  -6.868191 0.189425 2.555798
H  -6.329861 -2.765016 0.452707
