program: Gaussian 09
title: 000237382
version: EM64L-G09RevD.01
frameworkgroup: C1[X(C12H15N)]
method: RPBEPBE
basis: SDD
operation: Freq
keyword: #pfreq=noraman
keyword: PBEPBE/SDD
title: #p freq=noraman PBEPBE/SDD
converged: YES YES NO NO
title: Mulliken charges:
elementType: N C C C C C C C C C C C C H H H H H H H H H H H H H H H
charge: -0.106358 0.420584 0.101221 -0.383261 0.273608 -0.806425 -0.768845 -0.786503 -0.397795 -0.362256 -0.203140 -0.218778 -0.259419 0.216658 0.228002 0.231606 0.231192 0.242711 0.206257 0.255734 0.256854 0.236207 0.235869 0.246165 0.239643 0.222948 0.221999 0.225522
chargesum: 0.00000
title: Mulliken charges with hydrogens summed into heavy atoms:
elementType: N C C C C C C C C C C C C
charge: -0.106358 0.420584 0.101221 -0.166604 0.273608 -0.115624 -0.064143 -0.057572 -0.151630 -0.122613 0.019808 0.003220 -0.033897
polarizability: 2.38161326e+02 2.24363267e+00 1.22448668e+02 -1.20305071e+00 1.08341702e+01 9.40760237e+01
1716.lowfreq: -3.9452 0.0003 0.0006 0.0008 3.5191 8.9387 22.3257 50.7887 62.7788
frequency: 20.7944 50.7589 62.7500 70.9356 104.1177 153.4776 163.8499 174.1152 216.9620 273.1553 291.1384 335.7562 405.6140 415.0364 444.4345 480.4633 510.9275 527.4261 575.7812 613.0939 661.6720 695.9828 740.9601 771.9187 821.9483 835.2389 849.3606 897.7754 925.8106 962.4192 962.9971 977.9039 981.4879 983.0134 984.1205 1021.5455 1027.0098 1059.0135 1075.6499 1078.2550 1151.9994 1167.4978 1179.6286 1229.3224 1269.3645 1305.1945 1369.2565 1378.7128 1380.7570 1388.5185 1396.7529 1436.0018 1443.6443 1449.2637 1459.0892 1460.3919 1464.6538 1470.0823 1471.5211 1572.7444 1583.8792 1606.2193 1650.5523 2961.0101 2980.1958 2980.8528 3033.7498 3060.0597 3060.7929 3083.0884 3090.2983 3097.9310 3109.7755 3119.6070 3127.3090 3141.3815 3151.7078 3165.2607
redmass: 1.8739 2.5244 3.5542 2.6699 1.7794 1.3167 2.4398 1.8987 1.4175 3.3935 3.3743 2.7048 2.9887 3.4110 2.5911 3.1500 4.0422 3.9247 2.5511 6.3246 4.1506 1.8398 3.5262 2.3182 3.3320 1.2462 1.2715 1.4477 4.1177 1.2846 1.3441 1.6845 1.6977 1.9383 1.7889 2.0446 1.6713 1.5910 1.5515 1.7018 2.3367 1.0585 1.1656 4.1595 2.9596 1.4094 5.2855 1.3342 1.2536 1.3936 1.2170 2.4155 1.0740 1.1153 1.1122 1.0793 1.1136 1.1769 1.6093 6.0529 7.2151 6.3239 6.3479 1.0370 1.0369 1.0376 1.0961 1.0965 1.0952 1.0992 1.1003 1.0895 1.0984 1.0846 1.0874 1.0934 1.0953 1.1012
irintensity: 0.2997 1.3678 1.1611 0.3624 3.0469 0.8017 1.2621 2.4031 0.1342 0.9333 0.1531 0.7758 0.9265 1.9737 2.2228 6.5321 5.0143 6.5776 0.5791 0.4682 8.7144 42.4280 28.7555 63.1616 0.7736 0.7283 15.0883 5.8001 3.0254 2.1636 0.7581 8.9959 0.8122 4.7888 1.3907 8.7949 8.8328 12.6114 18.5532 8.3986 67.4277 0.6403 0.7293 43.3468 2.6552 0.6569 1.0485 27.2781 13.3714 41.7578 9.9728 3.7925 13.0846 32.5707 6.2248 28.2346 9.0673 28.7313 41.0961 15.1873 356.9440 0.3273 70.4181 35.3436 30.5875 8.8511 19.4132 10.8215 28.9319 12.9526 39.4850 35.4593 19.2400 5.6407 3.4441 24.1746 32.5457 23.8867
temp: 298.150 k
press: 1.00000 atm
elementType: 7 6 6 6 6 6 6 6 6 6 6 6 6 1 1 1 1 1 1 1 1 1 1 1 1 1 1 1
symmnumber: 1
zpe: 613999.7 jmol-1
zpe.correction: 0.233860 hartree
zpe.thermalcorrener: 0.247589 hartree
zpe.thermalcorrenthalpy: 0.248534 hartree
zpe.thermalcorrgfe: 0.192037 hartree
zpe.sumelectzpe: -520.047332 hartree
zpe.sumelectthermal: -520.033602 hartree
zpe.sumelectthermalent: -520.032658 hartree
zpe.sumelectthermalfe: -520.089155 hartree
dipole: 1.6348 1.1189 -0.0506
dipole: 1.9816
quadrupole: -67.5208 -74.8410 -78.3141
quadrupole: -0.0108 -0.0810 2.8944
quadrupole: 6.0379 -1.2824 -4.7555 -0.0108 -0.0810 2.8944
hfenergy: -520.2811917 hartree
pointgroup: C01 [X(C12H15N1)]
dipole: -0.6437908 -0.1840998 0.3993351 debye
polarizability: 237.7955453|7.8223661|90.8050019|0.3312611|0.2222062|126.08547 unknown
InChI: InChI=1S/C12H15N/c1-10(2)9-11(3)13-12-7-5-4-6-8-12/h4-9H,1-3H3
charge 0 multiplicity 1
28 atoms
N  -0.314639 0.062547 -0.08535
C  -3.317703 0.215016 -0.213348
C  -1.081901 -0.476108 0.843992
C  -2.551209 -0.443526 0.720784
C  1.094249 0.178592 -0.002179
C  -4.830484 0.119745 -0.148889
C  -2.758424 1.052368 -1.344002
C  -0.560794 -1.2041 2.086038
C  1.880508 -0.291274 -1.09323
C  1.747838 0.856418 1.069532
C  3.28019 -0.123348 -1.091436
C  3.147281 1.040327 1.051787
C  3.924432 0.544572 -0.021189
H  -3.082821 -1.01268 1.496754
H  -5.178461 -0.52488 0.676355
H  -5.235432 -0.28109 -1.09947
H  -5.27894 1.125044 -0.019896
H  -2.243262 0.412774 -2.085521
H  -3.558518 1.617675 -1.854786
H  -1.976705 1.743466 -0.984511
H  0.528142 -1.362954 2.046687
H  -0.795721 -0.630975 3.003368
H  -1.062935 -2.184474 2.182281
H  1.372717 -0.785204 -1.928261
H  1.148559 1.258981 1.894456
H  3.870323 -0.504239 -1.93304
H  3.63142 1.573081 1.878695
H  5.010688 0.685546 -0.029923
