program: Gaussian 09
title: 000237374
version: EM64L-G09RevD.01
frameworkgroup: C1[X(C9H22N2O4S2)]
method: RPBEPBE
basis: SDD
operation: Freq
keyword: #p
keyword: freq=noraman
keyword: PBEPBE/SDD
title: #p freq=noraman PBEPBE/SDD
converged: YES YES NO NO
title: Mulliken charges:
elementType: S S O O O O N N C C C C C C C C C H H H H H H H H H H H H H H H H H H H H H H
charge: 0.971060 0.971107 -0.544367 -0.542867 -0.544373 -0.542873 -0.495518 -0.495557 -0.269716 -0.573064 -0.573092 -0.092653 -0.092678 -0.663447 -0.654583 -0.663450 -0.654511 0.271966 0.271974 0.279261 0.273244 0.279264 0.273244 0.264734 0.264765 0.300339 0.300352 0.257073 0.219750 0.200874 0.218735 0.206880 0.237439 0.257025 0.219763 0.200880 0.218712 0.206875 0.237432
chargesum: 0.00000
title: Mulliken charges with hydrogens summed into heavy atoms:
elementType: S S O O O O N N C C C C C C C C C
charge: 0.971060 0.971107 -0.544367 -0.542867 -0.544373 -0.542873 -0.195179 -0.195206 0.274224 -0.020560 -0.020584 0.172081 0.172087 0.014250 0.008471 0.014219 0.008509
polarizability: 2.71780845e+02 3.99910545e-03 1.56999626e+02 -8.83684512e+00 -2.60664102e-03 1.55958151e+02
1716.lowfreq: -7.6497 -1.3561 -0.0012 0.0009 0.0013 5.7924 9.4119 13.8609 21.1050
frequency: 9.0603 13.8065 21.1003 31.8988 39.0514 49.4230 56.6075 75.4846 88.0955 107.6494 117.8959 147.5024 155.1542 203.3584 203.4879 210.1538 212.4280 225.1928 230.5955 231.5009 243.7465 253.5816 272.3950 280.1151 280.4797 336.3999 356.8936 368.7154 378.0942 429.4258 430.0577 477.0675 479.1171 514.6545 518.3884 562.8192 642.4888 779.1420 799.3382 800.7235 808.3124 814.9505 815.3692 857.4867 858.0844 915.1613 919.3383 921.7865 924.9460 926.9049 938.6113 942.3116 943.2765 1034.2145 1034.2327 1059.2128 1092.7929 1120.5349 1125.5185 1137.9999 1139.6660 1160.0892 1160.7247 1221.5127 1243.9930 1269.6747 1271.1654 1271.5311 1293.6606 1296.4834 1297.2120 1350.0999 1377.4353 1377.4621 1379.2454 1379.2619 1397.5951 1397.6298 1408.5934 1414.4800 1457.8723 1457.8735 1461.2465 1461.2655 1477.7346 1477.7485 1482.6300 1482.6475 1485.9459 2975.5727 2975.5919 2984.3879 2984.4642 3007.9228 3025.6425 3025.6668 3052.7286 3056.0288 3070.9645 3070.9691 3073.4423 3082.6361 3082.6546 3090.0401 3090.0869 3101.6594 3101.6869 3143.3826 3147.6675 3314.2450 3314.3106
redmass: 5.6764 3.9611 4.4374 3.0484 3.8485 3.4088 4.0143 4.8103 2.0417 4.5176 4.9875 4.4541 4.8876 1.0377 1.0381 4.9057 4.7884 4.8326 1.6644 1.6945 2.9101 2.1725 2.6967 2.8262 3.4221 8.0644 3.6253 4.0948 2.5535 2.4394 2.4802 4.5441 6.2554 3.7835 4.2154 7.7734 5.0671 1.1185 3.2005 3.2525 16.8231 1.8042 4.9148 1.5811 1.5194 2.6778 1.4378 1.3932 1.8610 1.9737 2.4865 1.3925 1.5610 1.6226 5.0472 3.1630 1.1527 1.7306 1.6460 2.2874 2.1731 1.8815 1.8782 1.1812 1.3150 1.2268 1.3120 1.3175 1.1071 1.4147 1.3883 1.3185 1.1714 1.1713 1.2066 1.2063 1.2003 1.2003 1.1219 1.0919 1.0494 1.0494 1.0488 1.0488 1.0520 1.0520 1.0455 1.0455 1.0832 1.0369 1.0369 1.0361 1.0361 1.0591 1.0845 1.0845 1.0561 1.0554 1.0992 1.0992 1.1052 1.0986 1.0986 1.1002 1.1002 1.1001 1.1001 1.1109 1.1101 1.0737 1.0737
irintensity: 0.2674 0.1176 0.0429 0.0877 7.7220 0.1168 0.0252 0.1368 0.5903 1.6295 1.2076 2.0342 11.2628 0.1289 0.1406 16.9744 6.3323 2.5429 1.7421 0.2295 38.9281 0.0562 64.5799 8.8986 6.8807 9.8882 12.5789 8.1828 0.1927 3.1055 1.4971 47.6784 0.9491 51.5380 36.2467 97.7799 0.9078 2.7688 143.5880 8.1428 4.0382 24.0849 96.4842 111.4599 38.3181 51.2041 6.8480 10.3137 2.7093 7.8988 1.0462 6.0322 0.2993 23.0448 0.7368 3.5490 1.8340 57.3036 11.2041 88.3779 1.2481 53.8668 0.8008 0.8506 1.4292 1.0275 5.8779 5.0702 0.3376 18.4517 0.1078 40.0968 12.5457 13.5947 23.4130 27.3157 18.6356 1.8996 0.1115 10.8611 2.2860 3.4139 7.4805 9.5267 6.3867 0.2626 17.9502 30.1985 14.2783 26.9231 8.5866 46.0500 24.9269 0.0008 1.0520 1.3712 6.3700 4.1627 5.0300 3.6562 0.0818 17.7030 87.0782 28.1562 13.3606 44.4840 13.5587 0.0009 1.9954 17.3387 10.1511
temp: 298.150 k
press: 1.00000 atm
elementType: 16 16 8 8 8 8 7 7 6 6 6 6 6 6 6 6 6 1 1 1 1 1 1 1 1 1 1 1 1 1 1 1 1 1 1 1 1 1 1
symmnumber: 1
zpe: 825114.5 jmol-1
zpe.correction: 0.314270 hartree
zpe.thermalcorrener: 0.338178 hartree
zpe.thermalcorrenthalpy: 0.339122 hartree
zpe.thermalcorrgfe: 0.255970 hartree
zpe.sumelectzpe: -1560.921668 hartree
zpe.sumelectthermal: -1560.897759 hartree
zpe.sumelectthermalent: -1560.896815 hartree
zpe.sumelectthermalfe: -1560.979967 hartree
dipole: -0.0006 -7.5658 -0.0031
dipole: 7.5658
quadrupole: -86.9286 -131.9482 -129.7914
quadrupole: 0.0002 -2.7151 0.0001
quadrupole: 29.2941 -15.7255 -13.5687 0.0002 -2.7151 0.0001
hfenergy: -1561.2359375 hartree
pointgroup: C01[X(C9H22N2O4S2)]
dipole: -0.0004246 -2.9766289 -0.0010807 debye
polarizability: 271.2532652|-0.00277|156.9996256|-11.7863128|-0.0020897|156.485731 unknown
InChI: InChI=1S/C9H22N2O4S2/c1-8(2)10-16(12,13)6-5-7-17(14,15)11-9(3)4/h8-11H,5-7H2,1-4H3
charge 0 multiplicity 1
39 atoms
S  2.799764 0.218791 0.355705
S  -2.799508 0.219598 -0.355214
O  2.944714 1.148494 -0.977049
O  2.718663 0.872854 1.847897
O  -2.944086 1.148428 0.978191
O  -2.71838 0.874674 -1.846958
N  4.146184 -1.118249 0.310925
N  -4.146209 -1.117211 -0.311315
C  0.000113 0.00028 0.000161
C  1.239437 -0.894724 0.113526
C  -1.239384 -0.894401 -0.113934
C  5.272769 -0.776753 -0.627595
C  -5.272851 -0.77628 0.627387
C  6.180443 0.362195 -0.113519
C  6.045808 -2.093371 -0.865151
C  -6.181375 0.362127 0.113553
C  -6.045071 -2.093341 0.864923
H  0.086661 0.64919 -0.891329
H  -0.086306 0.648494 0.892172
H  1.474857 -1.462396 -0.799935
H  1.250081 -1.545456 1.00256
H  -1.474912 -1.462778 0.799061
H  -1.25017 -1.544399 -1.003501
H  4.796544 -0.457565 -1.573216
H  -4.796734 -0.456963 1.573016
H  4.477235 -1.140354 1.299781
H  -4.477276 -1.138766 -1.300183
H  5.607286 1.297529 0.011452
H  6.996048 0.558426 -0.832682
H  6.640717 0.093668 0.857167
H  6.841293 -1.926345 -1.613891
H  6.524836 -2.449882 0.065854
H  5.370535 -2.883489 -1.2338
H  -5.608872 1.297866 -0.01128
H  -6.997063 0.557701 0.832803
H  -6.641547 0.09345 -0.857146
H  -6.840538 -1.926801 1.613781
H  -6.524021 -2.450049 -0.066049
H  -5.369287 -2.883092 1.233434
