program: Gaussian 09
title: 000237362
version: EM64L-G09RevD.01
frameworkgroup: C1[X(C6H13NO2S)]
method: RPBEPBE
basis: SDD
operation: Freq
keyword: #p
keyword: freq=noraman
keyword: PBEPBE/SDD
title: #p freq=noraman PBEPBE/SDD
converged: YES YES NO NO
title: Mulliken charges:
elementType: S O O N C C C C C C H H H H H H H H H H H H H
charge: 0.966974 -0.556158 -0.557218 -0.483580 -0.251074 -0.645720 -0.653769 -0.482630 -0.047984 -0.552683 0.276384 0.225248 0.242523 0.264931 0.224340 0.256407 0.251434 0.312511 0.274710 0.240280 0.255191 0.224341 0.215542
chargesum: 0.00000
title: Mulliken charges with hydrogens summed into heavy atoms:
elementType: S O O N C C C C C C
charge: 0.966974 -0.556158 -0.557218 -0.171069 0.025310 0.086982 0.078411 0.032360 0.207207 -0.112800
polarizability: 1.50587536e+02 -5.50578644e+00 9.07403106e+01 -1.50136662e+00 -9.61934718e-01 8.75509690e+01
1716.lowfreq: -14.3000 0.0021 0.0024 0.0025 6.7115 14.9220 20.8698 36.8667 50.2512
frequency: 18.4928 36.6276 50.0941 87.9274 134.4109 164.8574 187.9318 198.3766 229.1287 238.2096 243.5116 306.3466 328.7099 340.0638 367.5457 422.8286 435.4162 483.9758 519.2066 665.7458 798.9181 808.1999 872.1130 891.2636 912.0985 936.2278 943.8983 957.2339 962.0007 1009.4687 1023.5373 1054.1323 1128.0371 1140.8068 1169.6730 1220.0759 1237.7525 1277.2820 1293.1582 1310.2635 1365.4582 1384.7063 1398.8298 1421.3829 1437.4647 1453.2623 1465.5605 1471.0716 1487.9950 1654.5632 2986.7369 2989.3696 2991.6915 3050.8076 3064.6725 3079.6517 3085.5418 3086.8721 3103.4271 3109.1090 3114.3807 3198.2566 3339.9936
redmass: 3.2816 3.5499 3.4578 2.8065 3.4774 3.2539 2.5943 1.3284 1.6833 2.6743 3.0867 4.1710 2.8627 2.9879 2.5808 2.6845 3.3149 3.1246 4.5466 1.6870 2.6018 3.8842 2.6857 1.4624 5.0054 1.1573 1.3667 1.3501 2.3896 1.5797 1.6718 1.4367 1.8195 2.1695 1.8678 1.1811 1.2413 1.2523 1.1555 1.5798 1.1969 1.2087 1.1941 1.1259 1.1314 1.0436 1.0444 1.0485 1.0512 4.5645 1.0364 1.0364 1.0588 1.1025 1.0889 1.0980 1.0966 1.0605 1.1010 1.1002 1.0949 1.1141 1.0744
irintensity: 0.9293 1.9928 0.7521 1.2154 2.5024 1.6565 1.4051 0.5878 7.2081 25.9844 6.3112 6.9450 6.2366 1.4761 16.8244 4.4082 28.9637 13.2116 58.9507 19.6159 99.3586 135.9884 2.3557 5.3713 44.3670 7.3885 0.9141 89.3488 27.0577 3.5446 25.9779 43.6892 5.5360 0.4761 32.6073 11.8526 21.8110 6.1633 2.7919 1.1370 10.0615 37.4813 21.4665 11.3856 33.9522 9.0216 18.0942 3.3549 20.9111 7.6762 7.1732 23.6304 16.1716 1.7211 2.8545 3.0493 12.6275 10.3204 6.3653 15.6921 2.7143 20.8818 13.7719
temp: 298.150 k
press: 1.00000 atm
elementType: 16 8 8 7 6 6 6 6 6 6 1 1 1 1 1 1 1 1 1 1 1 1 1
symmnumber: 1
zpe: 485363.0 jmol-1
zpe.correction: 0.184865 hartree
zpe.thermalcorrener: 0.198443 hartree
zpe.thermalcorrenthalpy: 0.199387 hartree
zpe.thermalcorrgfe: 0.143314 hartree
zpe.sumelectzpe: -838.684989 hartree
zpe.sumelectthermal: -838.671411 hartree
zpe.sumelectthermalent: -838.670467 hartree
zpe.sumelectthermalfe: -838.726539 hartree
dipole: 1.0164 3.1822 -2.4447
dipole: 4.1395
quadrupole: -55.0788 -73.8098 -74.7471
quadrupole: -0.5150 -4.0696 -0.3264
quadrupole: 12.7998 -5.9312 -6.8686 -0.5150 -4.0696 -0.3264
hfenergy: -838.8698536 hartree
pointgroup: C01 [X(C6H13N1O2S1)]
dipole: -0.1533942 -1.6093271 -0.1973415 debye
dipolederiv: 1.6859665 -0.0469739 -0.0011616 -0.1126607 1.0007812 0.0084423 0.0244524 -0.03624 1.1251258 -0.7524548 -0.0647371 0.0157283 -0.0506616 -0.5909683 0.0834633 -0.045009 0.1840041 -0.6126402 -0.7315988 -0.0080684 0.0107935 -0.011121 -0.5602094 -0.0662849 0.1337819 -0.1592371 -0.6649963 -0.8654708 -0.0376633 -0.0266695 -0.25157 -0.4891014 0.0443217 -0.02906 0.1188122 -0.2996702 0.5100054 0.1865151 0.0642463 0.285521 0.2042667 -0.059527 0.0745424 -0.0309021 0.0611935 -0.2127459 0.0245317 -0.0663693 -0.1733599 -0.0975391 0.0280792 -0.0959449 0.0689894 -0.0378414 -0.172831 -0.1090277 0.0378607 -0.1004071 -0.1201714 0.1099258 -0.0826706 0.0178596 -0.0879131 0.3149757 0.0173655 -0.0549997 0.3618732 0.125922 0.0145099 -0.2377286 0.0225788 0.1760623 0.0568595 -0.0312363 0.1121564 0.0204288 0.0691694 0.0654274 0.2012125 0.0389691 -0.2019505 -0.2027247 -0.0582258 0.0876895 -0.0969584 0.0893323 0.1239984 0.039667 0.1150198 -0.3248224 -0.053308 0.004438 0.0388155 0.0013525 -0.0032065 -0.0284536 0.0449822 -0.0322142 -0.0336622 -0.0806275 -0.099386 -0.0674466 -0.0554242 0.018746 -0.0384839 -0.0612266 -0.0413736 0.1085892 0.0964019 0.0283358 0.0159623 0.0782437 0.060416 -0.0530463 0.0880683 -0.0922594 -0.0209319 0.1385682 -0.0247846 0.0674708 0.031448 0.047412 0.093326 0.0281999 0.0787427 0.0068773 -0.0340848 -0.1339061 -0.0259811 -0.1446358 0.001657 -0.0026952 0.0108908 0.0180891 0.0869149 0.1254355 0.0370666 0.0173181 0.0822315 0.0508228 -0.1070709 0.0469585 -0.0306977 0.0138097 -0.0035757 0.1279517 -0.0576819 0.0965802 0.0684935 0.0283213 -0.0340944 0.0306896 0.0685877 0.0813015 0.0299395 -0.0165136 0.1218984 0.2183359 -0.0856328 0.0434254 -0.0659238 0.0668165 0.0750162 -0.0128053 -0.1095881 -0.1155652 0.0819295 0.051536 -0.0489718 -0.0017043 0.0238686 -0.1163078 0.102857 0.0659554 -0.0243202 -0.0415127 -0.0452827 0.0644497 -0.0347311 0.1003673 0.0625496 0.0880829 -0.0233348 0.0392364 -0.0364772 -0.0445882 -0.0614993 -0.0348349 0.1285288 0.0046308 -0.0680814 -0.0608433 -0.0802793 -0.0137623 -0.0759563 -0.1028109 -0.0754058 0.1530438 0.0740191 0.047812 -0.0234072 0.0981499 -0.0843359 -0.0443292 -0.0016153 -0.0582303 0.1646428 unknown
polarizability: 150.4663085|5.4099904|90.9909463|3.3018727|-0.3435222|87.4215606 unknown
InChI: InChI=1S/C6H13NO2S/c1-4-5-7-10(8,9)6(2)3/h4,6-7H,1,5H2,2-3H3
charge 0 multiplicity 1
23 atoms
S  -0.514571 0.181294 0.042796
O  -0.303489 1.122227 -1.27766
O  -0.785034 0.835546 1.514182
N  0.991497 -0.971071 0.182431
C  -1.955045 -1.119399 -0.361555
C  -3.152807 -0.295265 -0.832698
C  -2.16182 -1.960417 0.894092
C  2.105777 -0.573895 -0.742101
C  3.007793 0.512765 -0.193458
C  4.305099 0.318502 0.153712
H  -1.472116 -1.677624 -1.181632
H  -3.94768 -0.985987 -1.171471
H  -3.561298 0.322808 -0.013816
H  -2.883268 0.36317 -1.675883
H  -2.984746 -2.677103 0.711917
H  -2.442043 -1.32414 1.751932
H  -1.256126 -2.534955 1.151442
H  1.267859 -0.869197 1.18074
H  1.63726 -0.240579 -1.688056
H  2.676606 -1.498661 -0.94952
H  2.547159 1.50487 -0.082815
H  4.92124 1.132335 0.551648
H  4.790956 -0.659624 0.041872
