program: Gaussian 09
title: 000237368
version: EM64L-G09RevD.01
frameworkgroup: C1[X(C15H26N2O4S2)]
method: RPBEPBE
basis: SDD
operation: Freq
keyword: #p
keyword: freq=noraman
keyword: PBEPBE/SDD
title: #p freq=noraman PBEPBE/SDD
converged: YES YES NO NO
title: Mulliken charges:
elementType: S S O O O O N N C C C C C C C C C C C C C C C H H H H H H H H H H H H H H H H H H H H H H H H H H
charge: 0.969989 0.970005 -0.535212 -0.534947 -0.535241 -0.534924 -0.291836 -0.291879 -0.267117 -0.568704 -0.568714 -0.486205 -0.485236 -0.486196 -0.485136 0.035214 0.033045 0.035451 0.032750 -0.576574 -0.575959 -0.576685 -0.575825 0.271925 0.271940 0.272162 0.272005 0.272034 0.272134 0.231197 0.249556 0.248764 0.230672 0.231235 0.249518 0.248769 0.230623 0.255021 0.256623 0.254907 0.256744 0.221054 0.210107 0.220973 0.209921 0.221067 0.210113 0.220967 0.209906
chargesum: 0.00000
title: Mulliken charges with hydrogens summed into heavy atoms:
elementType: S S O O O O N N C C C C C C C C C C C C C C C
charge: 0.969989 0.970005 -0.535212 -0.534947 -0.535241 -0.534924 -0.291836 -0.291879 0.276749 -0.024538 -0.024546 -0.005452 -0.005799 -0.005443 -0.005743 0.290235 0.289668 0.290358 0.289494 -0.145413 -0.145065 -0.145505 -0.144952
polarizability: 3.96180645e+02 9.24630727e-02 2.04861070e+02 2.63302840e-04 2.70766877e-02 1.88215851e+02
1716.lowfreq: -8.8273 -8.5576 -4.3125 0.0007 0.0008 0.0024 4.7763 11.0393 11.8404
frequency: -7.8177 -4.8807 11.7153 15.3044 19.9555 23.1837 34.1322 50.8341 63.8866 76.1952 84.9691 85.2120 86.3653 86.4507 101.3668 103.6784 107.3719 148.5876 149.6872 184.1781 185.2697 214.5263 216.7044 218.0983 226.7139 230.9381 257.2320 260.3223 266.2723 320.4733 322.1376 322.1981 331.3696 365.9307 368.4980 371.3562 387.8502 437.4983 444.5018 444.6742 461.7958 522.1830 537.3683 562.6432 626.9232 631.2088 631.2942 642.0825 654.6939 779.0073 800.7815 807.3831 811.9265 830.0707 830.5044 863.6233 863.6362 907.2586 915.1260 915.8823 918.2050 919.4734 929.5107 947.8967 948.0013 954.0894 954.1044 981.4424 981.4742 1007.7140 1008.2528 1022.9882 1023.0107 1032.5798 1034.8212 1055.9050 1056.7338 1058.0906 1103.8542 1137.5996 1137.7167 1152.1307 1152.6366 1211.9523 1239.4876 1239.4982 1245.8822 1259.7051 1269.6923 1270.1821 1280.7898 1280.8415 1287.4794 1288.1980 1300.5031 1325.1948 1325.2606 1332.9415 1333.7082 1348.8922 1407.4301 1413.5663 1416.2233 1416.2788 1417.5161 1417.7162 1427.7051 1427.7412 1427.8038 1427.8848 1488.1110 1655.1118 1655.1151 1656.1612 1656.1715 2978.2596 2978.2813 2981.4053 2981.4507 3010.9122 3035.8956 3035.9152 3039.0243 3039.0429 3050.2280 3053.4951 3076.4586 3084.6320 3084.6345 3085.2237 3085.2458 3117.9978 3118.0014 3121.2121 3121.2154 3139.3083 3143.5840 3194.6092 3194.6121 3195.6798 3195.6979
redmass: 4.2752 4.4202 7.5239 3.2911 3.8499 3.0467 3.6862 4.6403 4.0387 4.5765 2.8282 2.8596 3.3698 3.0538 6.0247 4.1126 1.9624 2.5800 2.9699 3.6846 3.8109 5.0086 4.3333 5.8114 5.7579 5.3617 3.3344 2.8893 4.4559 5.6867 2.9538 3.0507 4.4223 2.6964 1.9049 2.6926 6.4820 6.1204 1.8455 1.8494 4.4503 2.9210 1.9742 3.2451 3.2977 1.6653 1.6650 3.1406 4.2510 1.1223 16.7632 15.9825 1.4513 3.3093 3.3289 1.5287 1.5286 4.3735 1.6598 1.6616 2.2931 2.2001 4.4238 1.3625 1.3580 1.3566 1.3565 1.6626 1.6626 1.1600 1.1610 1.4280 1.4218 5.1627 1.7435 3.1609 2.4603 2.3775 1.1219 2.1238 2.1247 3.0096 2.9481 1.1794 1.2201 1.2197 1.3055 1.2154 1.2470 1.2512 1.2231 1.2232 1.1489 1.1458 1.0879 1.1785 1.1779 1.2046 1.2003 1.3193 1.1184 1.0910 1.0894 1.0895 1.0837 1.0840 1.1759 1.1791 1.1768 1.1732 1.0836 4.6181 4.6181 4.5705 4.5705 1.0583 1.0583 1.0594 1.0594 1.0592 1.1015 1.1015 1.1020 1.1020 1.0559 1.0552 1.1052 1.0613 1.0613 1.0614 1.0614 1.0947 1.0947 1.0946 1.0946 1.1108 1.1099 1.1137 1.1137 1.1136 1.1136
irintensity: 0.0012 1.2825 0.0003 1.0690 0.1392 0.0654 3.2119 0.0321 0.0000 0.1834 1.4720 0.0344 0.9536 0.1868 0.6037 1.2330 0.4876 0.9723 5.5720 1.9119 0.0016 0.0123 0.1309 6.0927 38.9551 0.5247 0.0003 0.0000 104.7441 0.3454 0.0001 0.8608 0.1983 5.7341 0.0016 21.3079 38.9675 8.8935 0.0006 0.4468 45.5073 10.1336 0.0045 105.1712 0.0006 0.0896 40.1679 308.4764 0.1874 1.5562 1.3747 109.2702 0.0580 14.4061 0.4363 0.1009 0.1075 83.5148 84.8242 3.8100 0.0006 41.5641 0.0017 0.1328 309.1604 18.2193 1.4106 0.7935 2.2264 34.3721 0.0015 1.3286 0.6006 0.2813 34.1812 3.1628 0.0148 90.3664 0.0000 16.1460 2.3104 13.1222 0.0008 1.8988 8.6809 0.0327 3.3570 1.4981 25.8710 20.0752 0.0447 3.1530 16.6924 0.0146 0.0001 5.1302 0.1577 81.0511 0.2434 30.8032 0.1765 4.8832 5.2641 31.0332 7.2163 22.9124 43.1686 2.1064 37.1479 16.4030 13.9778 0.3396 0.5014 17.4182 2.9425 2.6822 9.1452 3.5499 48.2079 0.0121 2.5392 4.1745 7.6275 5.7498 8.8722 4.9896 0.0264 1.7799 2.7118 28.9368 12.4985 0.0054 0.0042 1.8986 3.3149 0.0000 2.4840 0.6235 1.3051 6.8357 70.2429
temp: 298.150 k
press: 1.00000 atm
elementType: 16 16 8 8 8 8 7 7 6 6 6 6 6 6 6 6 6 6 6 6 6 6 6 1 1 1 1 1 1 1 1 1 1 1 1 1 1 1 1 1 1 1 1 1 1 1 1 1 1
symmnumber: 1
zpe: 1017017.4 jmol-1
zpe.correction: 0.387361 hartree
zpe.thermalcorrener: 0.415937 hartree
zpe.thermalcorrenthalpy: 0.416881 hartree
zpe.thermalcorrgfe: 0.323296 hartree
zpe.sumelectzpe: -1791.429138 hartree
zpe.sumelectthermal: -1791.400562 hartree
zpe.sumelectthermalent: -1791.399618 hartree
zpe.sumelectthermalfe: -1791.493203 hartree
dipole: 0.0001 0.0074 8.0696
dipole: 8.0696
quadrupole: -125.2839 -167.6018 -157.1769
quadrupole: 0.0996 -0.0013 0.0131
quadrupole: 24.7370 -17.5810 -7.1560 0.0996 -0.0013 0.0131
hfenergy: -1791.8164992 hartree
pointgroup: C01 [X(C15H26N2O4S2)]
dipole: 0.0002307 0.0007222 3.174838 debye
polarizability: 396.177391|0.7942333|204.8642392|-0.019172|-0.0461713|188.2159367 unknown
InChI: InChI=1S/C15H26N2O4S2/c1-5-10-16(11-6-2)22(18,19)14-9-15-23(20,21)17(12-7-3)13-8-4/h5-8H,1-4,9-15H2
charge 0 multiplicity 1
49 atoms
S  -2.828556 -0.006248 -0.285919
S  2.828495 0.006692 -0.286436
O  -2.846312 -1.430365 -1.086035
O  -2.858108 1.420122 -1.081903
O  2.846012 1.430349 -1.087371
O  2.857944 -1.420133 -1.081615
N  -4.167052 -0.01196 1.069884
N  4.167271 0.013396 1.069081
C  -0.000007 0.000394 -0.073678
C  -1.24332 -0.001214 0.823269
C  1.243468 0.002169 0.823048
C  -4.925963 1.279506 1.09171
C  -4.912875 -1.310905 1.094953
C  4.925433 -1.278486 1.092483
C  4.913767 1.312019 1.092492
C  -5.942854 1.555474 -0.003321
C  -5.914246 -1.608598 -0.009169
C  5.942913 -1.556056 -0.001593
C  5.913903 1.608636 -0.013049
C  -7.213716 1.959146 0.236865
C  -7.182444 -2.026504 0.220331
C  7.213154 -1.960916 0.239881
C  7.182759 2.025558 0.214576
H  0.001119 -0.89597 -0.721429
H  -0.001246 0.896616 -0.721619
H  -1.364054 0.908122 1.432975
H  -1.359508 -0.909169 1.435902
H  1.359865 0.910279 1.435404
H  1.364213 -0.907015 1.432985
H  -5.411847 1.311543 2.087066
H  -4.164348 2.083281 1.073019
H  -4.143196 -2.107184 1.093824
H  -5.410318 -1.337935 2.084756
H  5.410606 -1.310041 2.088203
H  4.163354 -2.08183 1.073926
H  4.144462 2.108647 1.09187
H  5.412446 1.339348 2.081662
H  -5.56176 1.497494 -1.031979
H  -5.521879 -1.555045 -1.033781
H  5.562731 -1.498255 -1.030596
H  5.520044 1.55522 -1.037097
H  -7.898315 2.211406 -0.580234
H  -7.612627 2.043581 1.256363
H  -7.854342 -2.29485 -0.602195
H  -7.592027 -2.106905 1.235919
H  7.898181 -2.214339 -0.576496
H  7.611099 -2.045241 1.259767
H  7.85373 2.293135 -0.608961
H  7.593846 2.105832 1.229565
