program: Gaussian 09
title: 000237348
version: EM64L-G09RevD.01
frameworkgroup: C1[X(C12H8N2O6S3)]
method: RPBEPBE
basis: SDD
operation: Freq
keyword: #p
keyword: freq=noraman
keyword: PBEPBE/SDD
title: #p freq=noraman PBEPBE/SDD
converged: YES YES NO NO
title: Mulliken charges:
elementType: S S S O O O O O O N N C C C C C C C C C C C C H H H H H H H H
charge: 0.877923 0.100256 0.174152 -0.512265 -0.516484 -0.173523 -0.192914 -0.220367 -0.185839 0.032460 0.013167 -0.044313 -0.042059 -0.361266 -0.372154 -0.243590 -0.249911 0.570845 0.520756 -0.170040 -0.120421 -0.459993 -0.440537 0.329611 0.330307 0.296865 0.297335 0.268504 0.248044 0.149661 0.095788
chargesum: 0.00000
title: Mulliken charges with hydrogens summed into heavy atoms:
elementType: S S S O O O O O O N N C C C C C C C C C C C C
charge: 0.877923 0.249917 0.269940 -0.512265 -0.516484 -0.173523 -0.192914 -0.220367 -0.185839 0.032460 0.013167 -0.044313 -0.042059 -0.031654 -0.041846 0.053275 0.047424 0.570845 0.520756 0.098464 0.127623 -0.459993 -0.440537
polarizability: 3.15392481e+02 -9.80883368e+00 2.60462283e+02 1.33799094e+00 4.42915546e+00 1.70390091e+02
1716.lowfreq: -3.0590 -0.8543 -0.0015 0.0012 0.0016 3.8791 15.9580 22.0229 22.9216
frequency: 15.5702 22.0221 22.8731 56.4079 60.2010 81.5215 91.0851 99.6107 121.1048 152.9154 163.2959 197.4984 200.3182 213.9321 220.5654 228.3115 266.6500 278.1424 304.1647 350.3682 360.9968 368.7741 399.7927 403.3625 415.1931 432.0646 433.1640 436.8833 466.7667 488.6348 536.4499 544.7537 552.8300 564.7569 581.0860 650.0362 651.8343 674.3356 676.8451 704.1275 711.5840 731.9113 735.3457 778.1350 784.0057 814.5259 822.7307 832.3299 849.8861 933.1317 945.3454 948.5288 952.1433 977.0183 987.1531 1031.4125 1038.4956 1069.7218 1074.2289 1092.0099 1101.7454 1138.5002 1154.9463 1179.3851 1197.3335 1246.7623 1248.3950 1332.9895 1351.9730 1368.0126 1371.4263 1405.2029 1407.3377 1436.5985 1440.5633 1557.9834 1570.9955 1586.4170 1591.2983 2038.8019 2334.0108 3142.9218 3153.3111 3163.3930 3165.6465 3166.3797 3171.2001
redmass: 10.4530 13.1797 10.0086 10.6531 11.1871 9.1028 12.7111 7.7596 8.8513 5.4649 6.7983 11.5786 12.1778 14.0885 6.9340 12.7676 11.6158 7.8251 8.3087 10.3623 10.5443 9.9190 9.5973 8.8553 1.1526 3.9133 3.6305 6.9952 8.1152 6.7757 2.7482 3.5013 1.3968 6.2510 7.4291 7.7615 7.9038 5.9549 6.2482 9.5404 9.7385 5.2297 5.7288 3.0712 2.5682 8.0867 5.1576 1.4127 1.3716 10.5171 1.4798 1.3160 1.2568 1.3572 1.3581 6.6227 6.6832 2.4914 2.4676 3.1042 3.4813 1.9280 1.3446 2.6115 11.9778 1.3395 1.3952 4.5233 4.8552 5.4758 5.8191 6.9231 7.3017 2.3335 2.4672 8.0278 8.3214 7.2265 7.1824 1.0487 1.0369 1.0889 1.0885 1.0947 1.0928 1.0928 1.0977
irintensity: 1.8323 0.6942 2.2170 1.1954 0.5746 2.1124 4.3232 0.3714 0.2006 3.9193 0.9999 2.4165 1.8710 5.1088 33.5108 0.9003 2.8226 4.9670 4.6444 2.6578 1.9711 5.0950 17.6754 31.1870 8.7839 10.1800 13.1942 41.5655 0.5554 30.2480 118.1410 64.4164 5.5943 6.5676 50.6976 3.9980 20.3881 1.3588 0.0005 6.7609 14.8247 2.2252 1.4644 89.5672 30.3890 48.7718 71.0773 7.1755 13.5149 59.7035 5.5437 12.6677 19.3427 0.2274 0.2952 81.5940 46.3942 53.4705 11.4712 46.6188 18.1421 38.5565 21.5358 186.1035 238.9347 30.9848 40.7578 51.3321 31.7241 20.0500 82.0964 1.7123 27.5369 115.9498 43.6147 26.0772 30.7085 21.8544 50.8069 158.9966 56.3676 1.9785 2.4339 3.8652 26.4237 8.6662 4.6151
temp: 298.150 k
press: 1.00000 atm
elementType: 16 16 16 8 8 8 8 8 8 7 7 6 6 6 6 6 6 6 6 6 6 6 6 1 1 1 1 1 1 1 1
symmnumber: 1
zpe: 482229.2 jmol-1
zpe.correction: 0.183671 hartree
zpe.thermalcorrener: 0.205289 hartree
zpe.thermalcorrenthalpy: 0.206233 hartree
zpe.thermalcorrgfe: 0.129949 hartree
zpe.sumelectzpe: -2215.104352 hartree
zpe.sumelectthermal: -2215.082734 hartree
zpe.sumelectthermalent: -2215.081790 hartree
zpe.sumelectthermalfe: -2215.158074 hartree
dipole: -0.3405 -1.8841 -3.3822
dipole: 3.8865
quadrupole: -170.0119 -156.2115 -174.5005
quadrupole: -34.4366 -0.1314 4.9691
quadrupole: -3.1039 10.6964 -7.5925 -34.4366 -0.1314 4.9691
hfenergy: -2215.288023 hartree
pointgroup: C01 [X(C12H8N2O6S3)]
dipole: -0.219772 -0.7760551 -1.2990308 debye
polarizability: 313.2617413|-14.4201185|262.8213672|0.0085159|1.0375967|170.1617463 unknown
InChI: InChI=1S/C12H8N2O6S3/c15-13(16)9-5-7(1-3-11(9)21)23(19,20)8-2-4-12(22)10(6-8)14(17)18/h1-6,21-22H
charge 0 multiplicity 1
31 atoms
S  0.006604 -0.010492 2.064351
S  -4.93248 1.980815 -1.677843
S  4.96288 -1.752637 -1.814404
O  0.471957 1.345982 2.848381
O  -0.450629 -1.398206 2.799075
O  -4.060172 -2.356913 -0.321808
O  4.039601 2.4067 -0.413264
O  -5.384931 -0.891287 -1.430634
O  5.296138 0.872483 -1.542949
N  -4.327692 -1.157213 -0.692994
N  4.292689 1.200182 -0.79217
C  -1.423516 0.505402 0.933298
C  1.423237 -0.48594 0.898921
C  -2.328368 -0.465754 0.527374
C  2.308952 0.503418 0.481801
C  -1.563104 1.872719 0.612175
C  1.577319 -1.843577 0.560055
C  -3.424319 -0.066964 -0.285351
C  3.385562 0.119748 -0.352972
C  -2.651021 2.254351 -0.18238
C  2.656692 -2.204298 -0.261654
C  -3.608188 1.306794 -0.662375
C  3.585486 -1.237574 -0.747809
H  -2.233649 -1.511642 0.835475
H  2.216308 1.548633 0.793715
H  -0.852284 2.608368 1.002892
H  0.884268 -2.59315 0.95633
H  -2.787316 3.307401 -0.446698
H  2.788315 -3.258029 -0.529673
H  -5.514207 0.68821 -1.811767
H  4.570567 -3.095127 -1.807797
