program: Gaussian 09
title: 000237321
version: EM64L-G09RevD.01
frameworkgroup: C1[X(C7H12O4)]
method: RPBEPBE
basis: SDD
operation: Freq
keyword: #pfreq=noraman
keyword: PBEPBE/SDD
title: #p freq=noraman PBEPBE/SDD
converged: YES YES NO NO
title: Mulliken charges:
elementType: O O O O C C C C C C C H H H H H H H H H H H H
charge: -0.256647 -0.258467 -0.275752 -0.438136 -0.127907 -0.158741 -0.069580 -0.139548 -0.341523 -0.313982 -0.506598 0.253319 0.255824 0.241206 0.249839 0.245835 0.200288 0.248026 0.199203 0.340592 0.206957 0.238977 0.206816
chargesum: 0.00000
title: Mulliken charges with hydrogens summed into heavy atoms:
elementType: O O O O C C C C C C C
charge: -0.256647 -0.258467 -0.275752 -0.097545 0.125412 0.097082 0.171626 0.110291 0.104600 0.133246 0.146153
polarizability: 9.65745018e+01 1.02620970e+00 7.71262167e+01 6.98218022e-01 4.31880797e+00 7.57529405e+01
1716.lowfreq: -13.9262 -8.3535 -0.0005 -0.0003 0.0003 6.2886 50.9340 82.8385 99.0851
frequency: 50.4118 82.8237 99.0767 121.2490 162.4794 207.3329 223.2078 258.5898 304.3509 351.3767 398.1066 420.1455 437.6306 607.5929 741.4104 753.7808 798.4772 815.9190 832.2108 853.6254 857.9925 874.5989 927.2764 943.2742 1007.9955 1016.6430 1028.0898 1047.6770 1060.5324 1064.9916 1072.6319 1114.7467 1151.7575 1154.6815 1166.7094 1183.3667 1212.9207 1233.0779 1261.8975 1274.1213 1279.1626 1292.6848 1326.7720 1337.8313 1343.6763 1378.4994 1436.6542 1460.7391 1461.4558 1468.1268 1474.3523 2937.4717 2985.9561 2992.5249 3003.4125 3015.1753 3022.5393 3035.0655 3060.9485 3092.2214 3094.3686 3105.6820 3563.1559
redmass: 5.1104 2.8885 2.1774 3.6688 1.7823 3.1624 2.9276 2.9810 1.1457 3.6605 3.2433 4.5623 3.7681 6.6456 5.3941 5.6015 2.9423 6.7661 3.7538 3.0622 3.9079 2.9880 3.0105 2.4695 3.4948 3.8265 3.6635 2.2820 2.0194 2.5740 1.8462 1.2859 1.2658 1.3959 1.3647 1.1340 1.6699 1.7048 1.1280 1.2717 1.2443 1.4222 1.3277 1.3122 1.4640 1.6152 1.1318 1.0599 1.0855 1.0817 1.0534 1.0338 1.0736 1.0659 1.0769 1.1023 1.0851 1.0878 1.0890 1.1007 1.1014 1.0981 1.0661
irintensity: 3.9117 0.9050 4.0292 0.7785 2.5916 17.9276 17.5840 3.6230 164.5223 3.4916 5.1513 4.3974 7.2132 13.1578 13.7552 12.8239 16.3290 16.2007 6.6479 12.0284 23.1444 0.8672 41.8730 30.6683 6.8449 80.4065 94.1467 17.7881 23.1065 63.3349 1.6886 1.1508 7.9212 13.2444 21.1464 9.5381 20.3669 32.1748 0.0921 2.7110 1.8869 1.9032 7.3916 4.9495 8.7198 4.3024 2.6561 10.0988 3.7495 14.5764 9.1360 68.7473 9.8843 37.6763 93.7354 55.9892 57.2649 20.0268 36.6538 33.0186 5.6669 27.6184 6.5914
temp: 298.150 k
press: 1.00000 atm
elementType: 8 8 8 8 6 6 6 6 6 6 6 1 1 1 1 1 1 1 1 1 1 1 1
symmnumber: 1
zpe: 492522.0 jmol-1
zpe.correction: 0.187592 hartree
zpe.thermalcorrener: 0.198595 hartree
zpe.thermalcorrenthalpy: 0.199539 hartree
zpe.thermalcorrgfe: 0.150478 hartree
zpe.sumelectzpe: -573.893955 hartree
zpe.sumelectthermal: -573.882952 hartree
zpe.sumelectthermalent: -573.882008 hartree
zpe.sumelectthermalfe: -573.931069 hartree
dipole: -0.7115 -0.3525 -0.4447
dipole: 0.9100
quadrupole: -60.4038 -68.5406 -63.7006
quadrupole: 7.1005 -5.7555 7.0973
quadrupole: 3.8112 -4.3256 0.5144 7.1005 -5.7555 7.0973
hfenergy: -574.0815466 hartree
pointgroup: C01 [X(C7H12O4)]
dipole: -0.2752804 -0.1318691 -0.1871313 debye
dipolederiv: -0.6697899 0.1237704 0.2268287 0.1735061 -0.5209924 -0.1174759 0.1822809 -0.0956227 -0.4835783 -0.8445186 -0.1552411 -0.1418078 -0.0626936 -0.379028 -0.0152835 -0.187173 -0.0071031 -0.4572932 -0.9020465 -0.2776063 -0.0922496 -0.2389656 -0.5952827 -0.0927394 -0.1959575 -0.1569159 -0.4457737 -0.7842076 0.0884059 0.1669907 0.1376632 -0.5236483 -0.2821042 0.135812 -0.2548649 -0.3127749 0.3413126 -0.0523508 0.1574595 0.0112682 0.1202331 0.0463349 0.3226232 0.0483249 0.3099798 0.2175611 -0.118081 0.0252219 -0.2371228 0.3651772 0.1611509 -0.1181171 0.1421233 0.2140226 0.6532218 0.2148536 0.0932531 0.0089996 0.1377629 0.0657822 0.2758691 0.1343747 0.3720162 0.4341033 -0.0566616 -0.2126002 -0.1814743 0.3976812 0.1999272 -0.1491048 0.1943552 0.2719827 0.401197 -0.1012481 -0.167245 -0.0307219 0.1178301 -0.0433492 -0.223857 0.1102233 0.4751299 0.5510637 0.1251803 0.0738371 0.2422151 0.3643192 0.1366334 -0.0069714 -0.0132072 0.111924 0.4609647 0.1457215 -0.0408059 0.2903214 0.513858 0.0650472 -0.1032386 -0.0093582 0.2721597 0.0331809 -0.0142053 -0.0452317 -0.0511316 -0.0990202 -0.076393 -0.0769082 -0.0732937 -0.0033711 0.0381659 0.0290492 -0.0187552 0.0439946 0.011997 -0.0538636 0.0184633 -0.0602025 -0.154445 -0.0503151 -0.0589909 0.0643837 -0.0327769 0.0538533 0.0784017 0.0203565 0.026789 -0.1261878 -0.0338001 -0.0639078 0.0565781 -0.0651199 -0.1318968 -0.006822 0.0585246 0.0201223 0.0404751 -0.0639791 0.1167047 0.0214872 0.102754 0.0366663 0.0006791 -0.0029818 0.0417188 0.0612554 -0.0099436 -0.0605778 -0.0634334 -0.0461328 0.0469402 -0.0287865 0.0072904 -0.0937765 -0.1766706 -0.0968708 0.0350196 -0.0655032 0.0694 0.0360573 0.0483585 -0.0522593 0.0157763 0.087665 0.0095414 -0.0032183 0.0340554 -0.0918813 -0.1283644 -0.1391412 0.0153059 -0.088723 -0.0071055 0.4093548 0.0320037 -0.0676543 0.0205461 0.2491716 0.1106652 -0.0094099 0.0811936 0.0328711 -0.0369638 0.1426511 0.0477654 0.03402 -0.1573391 -0.0480336 0.0564651 -0.0178313 0.0690355 -0.0617597 -0.0445216 -0.1166759 -0.0209198 0.0763983 0.0080168 -0.1428893 -0.0157613 -0.0002066 0.0045273 -0.0467496 0.0641014 -0.0757478 0.0076259 -0.0170049 0.175877 0.071659 -0.1511104 unknown
polarizability: 96.4302558|2.0460943|76.2632794|0.3858254|4.3767442|76.7601237 unknown
InChI: InChI=1S/C7H12O4/c1-9-5-3-11-6-4(8)2-10-7(5)6/h4-8H,2-3H2,1H3
charge 0 multiplicity 1
23 atoms
O  0.092881 1.681434 -0.516657
O  0.772513 -0.856798 1.284169
O  -2.458277 -0.096988 -0.479028
O  2.799251 -0.873388 -1.045304
C  -0.097305 -0.661837 0.098551
C  0.631758 0.336606 -0.827377
C  -1.395691 0.073531 0.520214
C  2.116838 0.25611 -0.393653
C  -0.973351 1.548845 0.508866
C  2.020376 -0.071764 1.100622
C  -3.160123 -1.377347 -0.364887
H  -0.281629 -1.646999 -0.360797
H  0.482716 0.1449 -1.90475
H  -1.733095 -0.270158 1.519211
H  2.634858 1.214283 -0.590078
H  -1.808805 2.205394 0.217669
H  -0.573621 1.849119 1.496976
H  2.865728 -0.695327 1.432676
H  1.966916 0.857106 1.701072
H  2.853753 -0.701532 -2.019472
H  -2.495263 -2.242755 -0.563729
H  -3.957145 -1.352424 -1.124413
H  -3.611785 -1.498712 0.642217
