program: Gaussian 09
title: 000237311
version: EM64L-G09RevD.01
frameworkgroup: C1[X(C19H14N4S)]
method: RPBEPBE
basis: SDD
operation: Freq
keyword: #p
keyword: freq=noraman
keyword: PBEPBE/SDD
title: #p freq=noraman PBEPBE/SDD
converged: YES YES NO NO
title: Mulliken charges:
elementType: S N N N N C C C C C C C C C C C C C C C C C C C H H H H H H H H H H H H H H
charge: 0.204706 -0.374451 -0.076848 -0.109772 -0.128330 -0.320267 0.398508 0.463015 -0.205121 -0.277420 -0.348684 -0.438456 -0.315466 0.158562 -0.271039 -0.360395 -0.243968 -0.209591 0.179493 -0.343443 -0.298445 -0.204466 -0.201233 -0.238363 0.322385 0.245137 0.255038 0.221704 0.316072 0.277361 0.250554 0.231253 0.231464 0.248889 0.274533 0.229820 0.227582 0.229681
chargesum: 0.00000
title: Mulliken charges with hydrogens summed into heavy atoms:
elementType: S N N N N C C C C C C C C C C C C C C C C C C C
charge: 0.204706 -0.052066 -0.076848 -0.109772 -0.128330 -0.320267 0.398508 0.463015 -0.205121 -0.032283 -0.093647 -0.216752 0.000606 0.158562 0.006323 -0.109840 -0.012715 0.021872 0.179493 -0.094554 -0.023912 0.025354 0.026349 -0.008681
polarizability: 7.34735467e+02 -4.55621785e+00 2.56721021e+02 6.71298727e-02 -1.64822291e-01 9.07698245e+01
1716.lowfreq: -2.5478 -0.0017 -0.0014 -0.0009 4.1110 12.3500 22.4832 27.6338 37.3791
frequency: 22.1840 27.5888 37.3667 54.2611 56.9901 83.7726 101.2550 141.6914 152.2721 185.3131 197.9252 211.3239 273.2829 292.6335 313.1163 313.5294 369.7715 379.8226 407.4187 424.9717 432.3942 482.2817 497.1847 498.0617 514.7713 521.0164 535.8152 552.2729 579.7039 591.1192 608.0903 609.2350 631.3060 649.9436 675.0509 692.5486 728.7536 742.4072 752.5748 762.2427 782.7329 790.8413 828.5992 832.4221 853.1822 860.0155 873.9732 886.0343 900.4979 941.0589 941.2631 979.9936 981.6143 985.4946 987.0669 997.0287 1000.8297 1001.5120 1014.5196 1015.0255 1035.4814 1074.9033 1099.7639 1112.5373 1125.4128 1139.4277 1157.2088 1169.6886 1169.9444 1188.1815 1233.7824 1241.6666 1261.2162 1295.2344 1299.4260 1304.8353 1349.5630 1374.0412 1376.8793 1389.7089 1433.6231 1437.1352 1443.3936 1444.9138 1464.2251 1483.5248 1518.1438 1563.7095 1576.1486 1581.9311 1588.0524 1602.2757 1612.5672 1624.1878 3107.6830 3127.1018 3137.2978 3137.9961 3150.9165 3152.1658 3156.7813 3164.8262 3165.2148 3168.6477 3171.5003 3175.8574 3189.6765 3540.7741
redmass: 5.3244 4.8781 5.9426 4.5360 5.5077 6.0220 6.0220 5.8823 8.0422 5.9822 6.5245 6.5564 5.7151 5.5401 5.7056 5.8277 8.3900 4.4660 2.9002 3.2634 3.1724 9.6407 2.7874 7.9964 8.9250 6.4203 4.5219 2.5756 2.3215 2.1299 7.8511 6.6408 7.3520 6.9268 7.1014 1.8759 2.7368 3.4004 6.9522 1.5128 1.8008 5.8868 6.4487 1.3741 1.2466 1.3831 1.4796 7.3761 7.1060 1.4318 1.3914 1.3517 1.3168 6.1813 1.3687 2.7625 1.3207 1.3233 2.0725 2.6342 3.8166 1.4908 3.2218 1.3482 1.7360 2.0739 1.2523 1.0950 1.0606 1.5385 2.3514 3.1013 1.8654 2.0635 1.5144 1.4641 6.8417 4.6255 5.1717 8.7984 2.9273 4.0814 2.4364 2.7344 2.2295 2.4220 2.1224 6.7812 6.4097 6.0650 3.9719 6.2762 6.6111 8.0847 1.0903 1.0850 1.0856 1.0888 1.0904 1.0930 1.0904 1.0960 1.0954 1.0937 1.0997 1.0999 1.0955 1.0762
irintensity: 0.1384 0.4831 0.5651 0.5006 0.0047 0.8232 2.5929 1.5138 1.8506 2.1400 1.6811 0.6418 0.0595 1.4523 0.0257 10.0743 3.2350 6.9890 0.0240 2.6980 7.0046 2.7941 4.1188 19.9675 3.0957 14.0404 12.5806 50.8490 14.9897 22.0955 49.1653 3.7536 0.4236 1.3426 4.8768 51.3148 12.5436 23.1999 10.3701 82.3237 40.3581 0.9468 0.9445 29.5067 0.0790 0.1260 70.0194 32.5041 7.9145 4.2232 8.8061 0.5431 0.0918 0.5963 0.0002 2.0460 1.7920 0.0018 13.0486 22.1425 3.9432 11.3329 113.7633 16.7830 3.4692 43.7079 142.8337 1.0987 0.0267 2.8093 8.5387 91.4815 140.2552 14.5367 69.8179 40.3628 67.9253 13.4292 148.3802 10.0139 20.0226 21.6412 6.8647 52.8488 3.5670 4.6645 486.5233 417.0878 442.3887 9.2292 112.8285 0.9229 619.6209 109.8082 26.2959 3.2651 1.6865 10.9021 9.4133 26.3548 2.9123 22.5299 20.0395 5.4650 41.8676 23.0142 4.6595 40.2703
temp: 298.150 k
press: 1.00000 atm
elementType: 16 7 7 7 7 6 6 6 6 6 6 6 6 6 6 6 6 6 6 6 6 6 6 6 1 1 1 1 1 1 1 1 1 1 1 1 1 1
symmnumber: 1
zpe: 746925.2 jmol-1
zpe.correction: 0.284489 hartree
zpe.thermalcorrener: 0.303798 hartree
zpe.thermalcorrenthalpy: 0.304742 hartree
zpe.thermalcorrgfe: 0.234347 hartree
zpe.sumelectzpe: -1347.831985 hartree
zpe.sumelectthermal: -1347.812676 hartree
zpe.sumelectthermalent: -1347.811732 hartree
zpe.sumelectthermalfe: -1347.882127 hartree
dipole: -1.4244 -1.3177 0.0072
dipole: 1.9404
quadrupole: -114.4263 -125.6998 -155.8368
quadrupole: 0.8639 -0.0110 -0.0351
quadrupole: 17.5613 6.2879 -23.8491 0.8639 -0.0110 -0.0351
hfenergy: -1348.1164741 hartree
pointgroup: C01 [X(C19H14N4S1)]
dipole: 0.5516503 -0.5275489 0.0140682 debye
polarizability: 734.7542821|-3.4239718|256.5431628|0.2189851|-5.13712|90.9288676 unknown
InChI: InChI=1S/C19H14N4S/c1-2-6-15(7-3-1)22-23-16-12-10-14(11-13-16)20-19-21-17-8-4-5-9-18(17)24-19/h1-13,20H
charge 0 multiplicity 1
38 atoms
S  4.895228 -1.987547 0.06318
N  2.128781 -1.622746 0.055105
N  3.52394 0.358012 -0.008349
N  -3.188266 0.360821 -0.007544
N  -4.162516 -0.517566 0.01619
C  5.805065 -0.414479 0.011857
C  4.891583 0.692095 -0.021271
C  0.814347 -1.094841 0.039264
C  3.33147 -0.944222 0.032572
C  7.198102 -0.226744 0.002785
C  5.403785 2.009713 -0.064336
C  -0.259933 -2.035697 0.067304
C  0.533865 0.29781 -0.002325
C  -1.879341 -0.204434 0.011157
C  -1.588757 -1.600829 0.053503
C  -0.805487 0.724287 -0.015703
C  7.690761 1.0993 -0.040649
C  6.800396 2.203885 -0.073802
C  -5.477348 0.052433 -0.003448
C  -6.541808 -0.887604 0.021348
C  -5.763478 1.447774 -0.044111
C  -7.880622 -0.443797 0.005558
C  -7.101848 1.881807 -0.059479
C  -8.164628 0.94168 -0.034818
H  2.192104 -2.642205 0.085797
H  7.888962 -1.07475 0.028164
H  4.706905 2.852463 -0.089751
H  -0.038239 -3.110831 0.099861
H  1.361062 1.008974 -0.023321
H  -2.421592 -2.309764 0.074406
H  -1.04924 1.791243 -0.047862
H  8.772451 1.269462 -0.048643
H  7.203599 3.221543 -0.107339
H  -6.290788 -1.953099 0.05256
H  -4.928475 2.154754 -0.062626
H  -8.698817 -1.171892 0.024702
H  -7.326608 2.954064 -0.090868
H  -9.203717 1.289428 -0.046969
