program: Gaussian 09
title: 000237313
version: EM64L-G09RevD.01
frameworkgroup: C1[X(C18H21N5O)]
method: RPBEPBE
basis: SDD
operation: Freq
keyword: #p
keyword: freq=noraman
keyword: PBEPBE/SDD
title: #p freq=noraman PBEPBE/SDD
converged: YES YES NO NO
title: Mulliken charges:
elementType: O N N N N N C C C C C C C C C C C C C C C C C C H H H H H H H H H H H H H H H H H H H H H
charge: -0.306742 -0.046208 -0.177305 -0.493132 -0.109077 -0.131057 -0.399622 -0.412922 -0.398653 -0.372806 -0.623990 0.295098 0.484830 -0.323656 -0.430496 -0.348408 -0.274479 0.153676 0.179575 -0.345300 -0.299649 -0.205208 -0.202092 -0.240188 0.230189 0.217263 0.218221 0.233487 0.232597 0.193983 0.271485 0.220737 0.194627 0.228178 0.232721 0.299070 0.313507 0.212596 0.249239 0.274591 0.247579 0.274657 0.228255 0.226445 0.228383
chargesum: 0.00000
title: Mulliken charges with hydrogens summed into heavy atoms:
elementType: O N N N N N C C C C C C C C C C C C C C C C C C
charge: -0.306742 -0.046208 -0.177305 -0.194062 -0.109077 -0.131057 0.047830 0.038786 0.027927 0.119417 0.031536 0.295098 0.484830 -0.010149 -0.217900 -0.099170 0.000113 0.153676 0.179575 -0.097721 -0.024992 0.023048 0.024353 -0.011806
polarizability: 6.25379512e+02 9.41813807e+00 2.18213329e+02 -1.25808445e+01 6.51908978e+00 1.16102341e+02
1716.lowfreq: -27.7167 -0.9281 -0.0011 0.0012 0.0018 4.2108 12.0727 16.6275 32.5874
frequency: -19.7843 15.3146 31.6145 35.9567 41.8561 70.5702 84.6001 96.7291 119.1256 134.7806 164.8451 173.0913 197.4947 206.8568 225.5668 272.5845 291.5577 318.4807 320.6526 360.6037 380.8065 407.3011 409.9006 414.5488 423.8698 442.4214 463.0334 499.4181 515.7337 537.9557 548.2977 554.7311 576.4056 609.0504 620.6253 636.4018 660.3198 692.8020 696.0914 741.3173 749.3697 782.0261 789.5826 816.6175 821.8465 830.6441 847.3599 852.6849 873.5373 900.0280 904.5578 939.4321 948.4363 977.4542 985.2885 986.0462 994.0630 996.2743 998.0736 1000.2051 1014.6115 1020.6813 1037.5294 1052.3322 1062.9121 1074.3120 1111.1682 1115.9112 1138.8707 1141.2049 1155.9030 1158.0899 1169.1874 1187.1293 1193.6858 1219.0789 1234.1477 1239.6685 1265.9326 1290.9118 1295.4912 1304.4563 1327.1027 1333.6173 1340.0073 1345.7581 1351.8307 1360.3334 1368.7061 1386.7961 1390.3291 1428.5193 1434.2010 1439.7873 1442.9435 1451.5587 1451.8500 1460.3936 1464.3627 1475.9396 1483.2017 1490.2144 1507.5992 1578.7030 1582.7500 1602.0541 1609.7744 1620.0869 2876.0829 2945.0543 2956.6061 2982.4952 2990.7663 3018.2067 3051.1080 3056.9442 3063.6107 3077.1495 3088.9291 3102.6987 3126.0133 3137.1952 3151.1878 3155.7318 3164.4275 3167.2926 3171.2447 3202.2560 3540.5124
redmass: 3.4139 4.1212 4.8364 4.0704 5.0519 5.5132 5.3654 6.2147 4.4136 4.9305 3.3058 4.1050 1.2184 2.8437 4.3475 5.4727 2.7773 5.9499 3.4333 6.6295 4.4865 2.9026 1.9597 2.3093 3.3464 3.1921 3.0873 2.7696 6.4542 6.7737 2.3603 3.3100 1.4161 6.2185 3.1799 5.2690 4.6403 1.8994 9.4447 3.5485 3.8683 1.8051 4.7112 5.7975 1.7368 1.3812 5.0731 1.2467 1.4949 7.1492 2.6100 1.4451 3.4032 1.3473 6.0660 1.3733 2.5827 2.4482 1.3573 1.3225 2.0668 1.8169 2.2916 2.0780 2.5355 1.4893 1.3323 1.3922 2.0577 2.2396 1.3017 2.1968 1.0601 1.5490 1.3510 1.4805 2.3038 2.7622 2.1420 1.5017 1.4907 1.4532 1.4573 1.2994 1.4318 2.9228 2.0846 1.5140 1.7855 3.9737 5.3553 1.1369 4.3933 1.0968 2.3878 1.1192 1.0884 1.0698 2.2373 1.0826 2.4202 1.0502 2.7610 5.9350 6.2622 6.2817 4.3988 6.2295 1.0556 1.0669 1.0693 1.0607 1.0618 1.0741 1.0937 1.1033 1.1030 1.1007 1.0930 1.0899 1.0849 1.0887 1.0931 1.0908 1.0963 1.0937 1.0992 1.0946 1.0749
irintensity: 0.6505 0.3932 0.6107 1.3640 0.6457 0.1929 3.4703 4.6893 0.7130 0.2804 0.1502 4.0800 0.2212 0.0961 0.5831 0.8640 13.0429 3.9592 3.1795 12.1695 6.3162 0.0531 5.5737 6.1886 1.3017 3.0763 0.9332 3.9951 23.2925 6.3553 90.9575 44.2047 15.2851 0.1377 5.1978 10.4976 2.0234 57.7322 17.1149 13.7434 11.4705 40.1849 1.2124 1.6118 1.4808 24.9425 7.8757 0.0693 69.7797 0.4039 6.3847 9.4339 20.8586 0.7693 0.2174 0.0058 68.3981 13.2535 1.6784 0.6562 11.6148 25.4404 10.5150 37.8352 15.7724 11.2230 17.5214 9.2137 80.8070 94.4516 184.2328 3.7338 0.0037 0.4869 113.8563 389.5297 184.4542 41.3934 82.1078 38.6845 94.2797 35.8780 69.7092 5.5440 2.9834 40.6038 22.1575 67.3491 48.5644 241.5291 204.9423 8.4068 64.0738 10.0651 19.5739 14.4255 1.7194 18.0780 5.0697 36.7305 77.0066 4.2100 1052.8551 29.5152 8.0039 1.5799 96.0976 514.3163 88.0079 49.7128 94.3845 36.9361 49.9931 76.5616 40.2011 38.0768 67.2385 34.9582 7.1990 36.0204 3.0186 11.3567 27.8926 4.6152 24.1175 5.6229 36.4866 4.4901 44.0578
temp: 298.150 k
press: 1.00000 atm
elementType: 8 7 7 7 7 7 6 6 6 6 6 6 6 6 6 6 6 6 6 6 6 6 6 6 1 1 1 1 1 1 1 1 1 1 1 1 1 1 1 1 1 1 1 1 1
symmnumber: 1
zpe: 958352.3 jmol-1
zpe.correction: 0.365017 hartree
zpe.thermalcorrener: 0.385787 hartree
zpe.thermalcorrenthalpy: 0.386731 hartree
zpe.thermalcorrgfe: 0.313397 hartree
zpe.sumelectzpe: -1045.714917 hartree
zpe.sumelectthermal: -1045.694147 hartree
zpe.sumelectthermalent: -1045.693203 hartree
zpe.sumelectthermalfe: -1045.766537 hartree
dipole: 4.1389 -3.7452 -0.9938
dipole: 5.6696
quadrupole: -108.0656 -133.4368 -148.3321
quadrupole: -9.5380 -9.2132 2.8758
quadrupole: 21.8792 -3.4920 -18.3873 -9.5380 -9.2132 2.8758
hfenergy: -1046.0799339 hartree
pointgroup: C01 [X(C18H21N5O1)]
dipole: 1.6194543 0.9839945 1.1767272 debye
polarizability: 625.7487365|-8.2128182|176.2194898|1.7579493|50.7032343|157.7269558 unknown
InChI: InChI=1S/C18H21N5O/c1-22-11-13-23(14-12-22)18(24)19-15-7-9-17(10-8-15)21-20-16-5-3-2-4-6-16/h2-10,19H,11-14H2,1H3
charge 0 multiplicity 1
45 atoms
O  3.082281 -1.678048 -1.133242
N  7.262142 0.921539 -0.331317
N  4.583896 -0.230905 -0.077298
N  2.245388 0.028056 0.257423
N  -3.37599 -0.465793 -0.388165
N  -4.138617 0.349224 0.302236
C  6.09893 1.745085 0.049026
C  6.823319 -0.219166 -1.172768
C  4.950949 0.943252 0.744232
C  5.724895 -1.081407 -0.50049
C  8.171957 0.568826 0.777661
C  3.28967 -0.686631 -0.366089
C  0.851991 -0.13256 0.070869
C  0.272099 -1.081483 -0.81684
C  -0.000114 0.727868 0.832018
C  -1.127518 -1.148774 -0.929712
C  -1.391302 0.653394 0.71275
C  -1.977283 -0.293486 -0.178816
C  -5.544843 0.166514 0.090427
C  -6.384861 1.058537 0.808693
C  -6.12188 -0.819236 -0.761343
C  -7.787031 0.972832 0.679193
C  -7.52153 -0.898947 -0.883632
C  -8.35973 -0.005995 -0.166853
H  5.684836 2.202907 -0.870641
H  6.43046 2.559815 0.719077
H  7.69815 -0.850821 -1.411306
H  6.425437 0.185849 -2.123185
H  5.268744 0.619276 1.75869
H  4.09765 1.634751 0.856366
H  5.328874 -1.839349 -1.195051
H  6.138192 -1.605913 0.38726
H  7.735048 -0.087912 1.56881
H  8.522374 1.495751 1.266571
H  9.056494 0.051027 0.365703
H  2.502319 0.727877 0.954404
H  0.924022 -1.743981 -1.387185
H  0.447877 1.458908 1.519101
H  -1.595399 -1.871703 -1.606258
H  -2.050089 1.30897 1.289928
H  -5.912813 1.804686 1.456686
H  -5.456645 -1.497087 -1.304837
H  -8.43096 1.663746 1.234357
H  -7.96904 -1.656372 -1.537432
H  -9.448649 -0.075625 -0.268419
