program: Gaussian 09
title: 000237242
version: EM64L-G09RevD.01
frameworkgroup: C1[X(C8H8FNO)]
method: RPBEPBE
basis: SDD
operation: Freq
keyword: #p
keyword: freq=noraman
keyword: PBEPBE/SDD
title: #p freq=noraman PBEPBE/SDD
converged: NO NO NO NO
title: Mulliken charges:
elementType: F O N C C C C C C C C H H H H H H H H
charge: -0.200645 -0.246983 -0.404783 0.290131 0.510132 0.225837 -0.352204 -0.493495 -0.452208 -0.779783 -0.067230 0.237946 0.328829 0.220770 0.244215 0.244214 0.217679 0.306196 0.171383
chargesum: 0.00000
title: Mulliken charges with hydrogens summed into heavy atoms:
elementType: F O N C C C C C C C C
charge: -0.200645 -0.246983 -0.098587 0.290131 0.510132 0.225837 -0.114258 -0.164666 -0.231438 -0.073676 0.104154
polarizability: 1.48954318e+02 3.12234428e+00 1.02831537e+02 1.83416292e-03 -1.62003266e-03 4.41273418e+01
1716.lowfreq: -7.6164 -0.0011 -0.0004 0.0003 2.3372 9.4614 63.4233 76.0478 129.6372
frequency: 63.3335 75.7620 129.6119 154.3020 203.1364 259.7912 276.4422 293.1498 385.8671 433.8584 455.6270 456.5608 537.0927 620.0853 647.9238 691.3858 711.8687 743.0376 811.2241 812.9828 906.9516 936.7930 938.9043 950.0919 996.6160 1047.2662 1077.9801 1123.8655 1172.1122 1205.4876 1265.5566 1277.2668 1364.5973 1390.8276 1402.5146 1419.9302 1461.0367 1467.8347 1495.7079 1512.5698 1594.7028 1631.4674 1638.4663 2924.6230 2984.7698 3064.4968 3091.8214 3119.0579 3147.2957 3195.5686 3520.2237
redmass: 4.3573 1.1303 3.0715 8.3929 4.3661 3.5322 3.5020 9.1737 3.4377 5.7368 3.0509 4.8681 6.8826 3.8258 1.2011 6.1661 2.9324 4.9626 1.3987 6.1877 1.4608 1.3443 4.0168 1.5727 1.5692 1.4989 2.4194 2.5529 1.6338 1.8360 1.4760 2.6002 2.1750 1.9911 1.3204 3.3507 1.0444 1.2545 1.7718 3.1063 5.1325 6.0551 5.7774 1.0864 1.0367 1.0975 1.0999 1.0883 1.0963 1.0935 1.0769
irintensity: 1.4144 2.9039 14.7119 6.3543 2.6391 1.9881 2.6363 6.7528 14.9993 2.5423 5.9133 7.3678 2.3758 16.8591 62.8208 3.5948 1.8579 6.6628 53.5950 7.9646 46.0337 0.0253 21.9868 4.1839 8.4693 7.2340 17.4545 61.9085 21.8953 11.0027 2.4164 10.5852 14.5169 49.9723 9.3659 65.3133 12.9377 67.5669 3.3750 296.8523 62.4861 167.9108 112.8929 124.6844 27.5338 15.4615 17.0420 13.9986 15.0776 13.3734 14.5361
temp: 298.150 k
press: 1.00000 atm
elementType: 9 8 7 6 6 6 6 6 6 6 6 1 1 1 1 1 1 1 1
symmnumber: 1
zpe: 377358.7 jmol-1
zpe.correction: 0.143728 hartree
zpe.thermalcorrener: 0.153875 hartree
zpe.thermalcorrenthalpy: 0.154819 hartree
zpe.thermalcorrgfe: 0.107690 hartree
zpe.sumelectzpe: -538.683104 hartree
zpe.sumelectthermal: -538.672957 hartree
zpe.sumelectthermalent: -538.672013 hartree
zpe.sumelectthermalfe: -538.719142 hartree
dipole: -0.3146 -5.5409 0.0005
dipole: 5.5498
quadrupole: -57.0078 -63.1243 -66.2468
quadrupole: -9.2273 0.0009 -0.0005
quadrupole: 5.1185 -0.9980 -4.1205 -9.2273 0.0009 -0.0005
hfenergy: -538.8268324 hartree
pointgroup: C01 [X(C8H8F1N1O1)]
dipole: -0.1941752 -2.174455 -0.0387782 debye
dipolederiv: -0.3473687 0.2420083 0.0040472 0.3395058 -0.9103692 -0.0130443 0.0058191 -0.0132273 -0.1525179 -0.5489037 0.0004672 -0.0002934 -0.7054606 -0.9713911 -0.0121467 -0.0127264 -0.0108869 -0.3516842 -1.5430916 -0.3283686 -0.007613 -0.4322246 -0.4216978 -0.0023034 -0.0096311 -0.0022924 -0.3285869 0.231754 -0.1433693 -0.0021821 -0.0154358 -0.2618868 -0.0036445 0.0000619 -0.0038312 -0.0581019 1.0868111 -0.0366085 0.0007712 -0.2010386 0.1047371 -0.000232 -0.0020305 0.000048 0.0994314 0.3406105 -0.1992524 -0.0032123 -0.4181569 1.0518744 0.0168183 -0.0071045 0.0171799 0.0768539 0.0659489 -0.0321897 -0.0002579 0.0998464 0.1396836 0.0052212 0.0021101 0.0050596 -0.1458482 -0.3190977 0.1064859 0.0016998 0.1245228 -0.1831762 -0.0000175 0.0020077 -0.0000734 -0.1719697 -0.3146014 0.0099001 0.0000134 -0.1489771 0.0169175 0.0039 -0.0028459 0.0041568 -0.2146329 -0.0882814 0.0674915 0.0009982 0.1512615 0.0709513 0.0001213 0.002496 -0.0000124 0.0749686 1.3203011 0.2716082 0.0066925 1.035786 1.309911 0.022351 0.0200987 0.0211267 0.1439216 -0.0099221 -0.1032867 -0.0020664 -0.0917315 -0.0165409 -0.0031369 -0.0018623 -0.0031568 0.1523513 0.1593527 -0.0433634 -0.0008241 -0.0023732 0.0974291 -0.0018992 -0.0001138 -0.0019651 0.2038978 0.0243302 0.1046157 0.0016504 0.0891234 -0.0708839 -0.0042727 0.001367 -0.0042615 0.1764314 -0.0035537 0.0188608 0.0236132 0.0387871 0.0566795 -0.1000641 0.0888027 -0.0863923 -0.0343803 -0.0032891 0.0194728 -0.0229039 0.0416564 0.0499749 0.1031545 -0.0873291 0.0894348 -0.0279423 0.0066626 -0.0432257 -0.0008971 -0.1539731 -0.0879315 -0.0036692 -0.0028479 -0.0035237 0.1086739 0.132186 -0.0243892 -0.0007438 0.0120636 0.1017391 -0.0039404 -0.0001353 -0.0039854 0.3243528 -0.1898477 0.1131428 0.001508 0.2368185 -0.07602 -0.0031952 0.0038636 -0.0033974 0.1247816 unknown
polarizability: 149.1076353|1.6231403|102.6594259|0.1793579|1.0428024|44.1461359 unknown
InChI: InChI=1S/C8H8FNO/c1-6-2-3-7(10-5-11)4-8(6)9/h2-5,10H,1H3
charge 0 multiplicity 1
19 atoms
F  -1.578654 2.17617 0.042219
O  3.202105 1.232657 0.03215
N  2.211094 -0.915517 -0.007518
C  -2.025397 -0.197786 -0.000742
C  0.814982 -0.634781 -0.0046
C  -1.082949 0.85433 0.019246
C  -1.479276 -1.504993 -0.02324
C  0.308851 0.690282 0.018198
C  -0.088227 -1.731616 -0.025324
C  -3.514984 0.074715 0.002205
C  3.279707 -0.02547 0.010165
H  -2.163284 -2.360951 -0.039437
H  0.980006 1.550951 0.034445
H  0.295222 -2.759465 -0.043065
H  -3.816916 0.646846 0.898632
H  -3.814753 0.678234 -0.87414
H  -4.086166 -0.869095 -0.015159
H  2.464068 -1.907201 -0.024782
H  4.253672 -0.568911 0.001948
