program: Gaussian 09
title: 000021269
version: EM64L-G09RevD.01
frameworkgroup: C1[X(C18H24O3)]
method: RPBEPBE
basis: SDD
operation: Freq
keyword: #pfreq=noraman
keyword: PBEPBE/SDD
title: #p freq=noraman PBEPBE/SDD
converged: YES YES NO NO
title: Mulliken charges:
elementType: O O O C C C C C C C C C C C C C C C C C C H H H H H H H H H H H H H H H H H H H H H H H H
charge: -0.231729 -0.444737 -0.269575 0.323509 -0.223393 -0.097157 -0.207061 -0.489212 -0.504725 -0.192791 -0.391802 -0.490670 -0.764810 0.319186 -0.580223 0.331937 -0.423257 -0.555784 -0.398054 0.320195 -0.536255 0.245378 0.202309 0.207753 0.205880 0.228219 0.219265 0.223821 0.231995 0.217470 0.218920 0.206133 0.218430 0.248871 0.209743 0.213475 0.222640 0.225465 0.231463 0.354478 0.255422 0.238612 0.243037 0.218971 0.218659
chargesum: 0.00000
title: Mulliken charges with hydrogens summed into heavy atoms:
elementType: O O O C C C C C C C C C C C C C C C C C C
charge: -0.231729 -0.090259 -0.269575 0.323509 0.021985 0.105152 0.000692 -0.055113 -0.061639 0.039204 0.044587 -0.066107 -0.092720 0.319186 -0.132117 0.331937 -0.191794 -0.300362 -0.159442 0.320195 0.144411
polarizability: 2.72725367e+02 5.08518996e+00 1.80277781e+02 -4.41949989e-01 -5.27160351e-01 1.41108268e+02
1716.lowfreq: -1.2676 -0.0009 -0.0004 0.0004 6.0322 15.0119 37.0028 64.8228 74.0772
frequency: 36.9581 64.7907 74.0302 88.9927 120.3169 140.3136 164.3931 173.1018 178.4085 205.7954 214.3847 227.1729 230.0723 259.6680 274.5432 295.3027 306.0213 342.2444 359.7469 379.3727 385.9137 407.4587 414.4806 447.9533 473.2764 489.9666 515.9909 535.4574 569.8011 575.8201 584.0313 609.5166 649.5633 696.4587 712.3909 721.3660 741.6252 783.3553 809.2623 834.9851 847.3054 858.9057 874.8430 887.4398 896.6574 908.0341 927.3027 934.4445 947.0612 962.1577 973.6952 981.5039 999.8354 1011.5776 1017.0750 1038.2710 1052.0858 1059.6110 1071.7598 1111.1860 1113.8998 1126.6846 1131.9966 1136.9799 1142.7426 1149.8905 1161.9915 1175.2153 1178.5478 1195.3395 1205.5745 1219.1077 1228.5531 1239.3492 1259.1091 1268.7589 1280.2196 1286.8186 1298.2141 1307.3113 1317.0153 1322.6389 1326.6524 1336.8993 1340.8528 1342.3492 1360.2229 1363.9251 1377.1552 1383.1528 1394.9101 1425.2345 1436.6426 1457.5183 1462.2775 1465.0515 1465.3189 1471.1908 1474.4101 1476.9385 1486.6492 1489.8693 1495.7781 1580.6572 1624.8276 2931.1408 2946.9043 2955.4462 2956.0488 2971.5760 2986.9213 2987.4088 2990.5727 2996.6340 2999.9751 3006.7807 3022.6378 3027.1229 3041.6520 3043.1666 3048.6551 3058.0289 3075.1389 3103.4893 3109.5155 3121.3514 3138.7865 3162.3316 3564.2803
redmass: 4.4075 4.3539 3.6328 3.7063 4.9762 3.3699 2.8760 2.7251 1.1055 4.9856 2.2306 2.2818 1.8518 2.1157 2.4045 2.6923 1.7574 1.7978 3.0157 3.3514 3.7558 2.9223 3.3051 2.7966 4.0745 3.9625 4.0873 4.0009 2.9237 3.2213 4.6294 3.1618 3.0174 3.7230 4.3926 3.3655 3.8347 2.2526 1.6286 2.7215 2.3512 2.1383 3.5320 1.6770 2.8911 2.0976 2.0422 1.3873 5.3253 2.2658 2.3501 2.6412 3.3613 2.2251 2.0371 2.3541 2.3515 2.0846 1.9934 1.2683 1.7775 1.5774 2.0295 1.9120 1.5219 1.5443 1.1417 1.4994 1.5892 1.6463 1.7490 1.7019 1.5308 1.9351 2.1186 1.5940 1.3978 1.2297 1.3009 1.3969 1.3165 1.3954 1.4847 1.3441 1.3952 1.4772 1.5471 1.5508 1.5467 4.6701 1.2565 2.8501 1.3126 1.1204 1.0763 1.0822 1.0508 1.0640 1.0748 1.0761 1.0817 1.0866 2.5269 7.1799 6.9234 1.0814 1.0834 1.0337 1.0645 1.0595 1.0433 1.0607 1.0600 1.0699 1.0721 1.0845 1.0939 1.0995 1.1038 1.1023 1.1018 1.1082 1.0965 1.0995 1.0890 1.0991 1.0914 1.0933 1.0655
irintensity: 0.2932 0.4875 2.0092 4.6979 4.2084 0.8633 2.0752 1.9769 0.6094 0.5096 3.2834 0.8522 0.2267 0.0872 1.5163 8.7428 67.6643 65.2960 5.0210 0.5028 12.9030 1.1014 9.6431 8.7527 13.5923 11.8976 6.4600 8.1029 4.4067 6.6243 2.5350 2.5073 2.4200 2.2561 4.3252 2.5975 9.2697 11.1313 26.6341 6.8513 4.5146 14.5644 13.5638 25.9508 14.7225 18.6906 36.0558 1.2160 155.4025 35.4269 15.8164 45.8968 37.2221 16.3415 8.5751 5.1603 8.7390 3.8699 11.1165 0.5067 5.7790 1.5334 25.0976 31.5878 16.9722 1.6678 11.2459 23.4069 15.2933 6.5428 2.0545 5.2074 6.7412 70.2820 71.2104 14.9181 2.3829 2.6095 4.2803 2.5292 2.6053 0.3179 0.2991 0.9081 2.2911 0.2253 1.0732 1.4735 2.6073 10.5339 18.8074 27.1492 1.3047 9.3354 0.9528 6.1500 13.1414 17.6284 47.7446 6.9071 9.4141 9.8866 112.2428 17.1939 77.2445 20.7295 33.1549 80.2230 25.4191 28.0956 7.7623 37.1227 23.8794 61.3878 50.4017 34.1999 34.1589 35.9105 51.3601 38.9698 48.8864 50.4758 39.2824 22.1222 21.3495 25.7210 6.6501 16.2433 7.5108
temp: 298.150 k
press: 1.00000 atm
elementType: 8 8 8 6 6 6 6 6 6 6 6 6 6 6 6 6 6 6 6 6 6 1 1 1 1 1 1 1 1 1 1 1 1 1 1 1 1 1 1 1 1 1 1 1 1
symmnumber: 1
zpe: 1007764.5 jmol-1
zpe.correction: 0.383837 hartree
zpe.thermalcorrener: 0.402906 hartree
zpe.thermalcorrenthalpy: 0.403850 hartree
zpe.thermalcorrgfe: 0.337942 hartree
zpe.sumelectzpe: -924.382239 hartree
zpe.sumelectthermal: -924.363170 hartree
zpe.sumelectthermalent: -924.362226 hartree
zpe.sumelectthermalfe: -924.428134 hartree
dipole: -1.0582 -1.1677 0.0857
dipole: 1.5781
quadrupole: -117.5520 -121.4023 -127.9257
quadrupole: 9.1751 0.2851 -3.8001
quadrupole: 4.7413 0.8910 -5.6324 9.1751 0.2851 -3.8001
hfenergy: -924.7660761 hartree
pointgroup: C01 [X(C18H24O3)]
dipole: 0.4126539 -0.4632862 -0.0242019 debye
polarizability: 272.6287762|-5.8700647|180.3773702|0.8228342|-0.0141666|141.1052701 unknown
InChI: InChI=1S/C18H24O3/c1-18-8-7-14-13-6-4-12(20-2)9-11(13)3-5-15(14)16(18)10-21-17(18)19/h4,6,9,14-17,19H,3,5,7-8,10H2,1-2H3
charge 0 multiplicity 1
45 atoms
O  -4.145841 -1.064342 1.247787
O  -5.342697 0.439796 -0.203933
O  5.578634 0.239859 -0.062375
C  -3.032399 -0.199524 -0.70306
C  -2.460356 0.574934 0.542943
C  -0.916602 0.751353 0.621843
C  -0.142322 -0.546852 0.249642
C  -2.170195 -1.459163 -1.010995
C  -0.663157 -1.14149 -1.091302
C  -4.395243 -0.67139 -0.137901
C  -3.027812 -0.214713 1.756426
C  -0.386893 1.947887 -0.209185
C  -3.209288 0.676956 -1.961033
C  1.372069 -0.32511 0.20663
C  1.088698 2.230217 0.141503
C  1.954066 0.973733 0.110038
C  2.234644 -1.446892 0.228465
C  3.357377 1.104144 0.021055
C  3.638211 -1.32513 0.146562
C  4.200794 -0.029574 0.035787
C  6.488954 -0.905832 -0.061399
H  -2.923294 1.58078 0.541111
H  -0.676538 0.989522 1.682904
H  -0.350104 -1.311374 1.029941
H  -2.514848 -1.906809 -1.964314
H  -2.333192 -2.218379 -0.21962
H  -0.099279 -2.06529 -1.322051
H  -0.451835 -0.438691 -1.920275
H  -4.811415 -1.5710 -0.632631
H  -2.287496 -0.903178 2.203634
H  -3.420721 0.452519 2.544292
H  -0.99805 2.847669 -0.00202
H  -0.478652 1.741771 -1.292091
H  -3.785262 1.586907 -1.727553
H  -2.235289 0.972978 -2.387234
H  -3.762293 0.12273 -2.742576
H  1.136296 2.667822 1.161254
H  1.510451 2.993121 -0.540414
H  1.797591 -2.450226 0.316079
H  -6.151267 0.183903 0.308774
H  3.821495 2.093679 -0.059027
H  4.26486 -2.22152 0.17034
H  7.49609 -0.473299 -0.155593
H  6.291571 -1.580092 -0.917987
H  6.41734 -1.479308 0.883761
