program: Gaussian 09
title: 000237249
version: EM64L-G09RevD.01
frameworkgroup: C1[X(C13H9ClO3)]
method: RPBEPBE
basis: SDD
operation: Freq
keyword: #p
keyword: freq=noraman
keyword: PBEPBE/SDD
title: #p freq=noraman PBEPBE/SDD
converged: YES YES NO NO
title: Mulliken charges:
elementType: Cl O O O C C C C C C C C C C C C C H H H H H H H H H
charge: -0.063726 -0.281274 -0.446318 -0.217655 0.225797 0.121450 0.403593 -0.353084 -0.293660 -0.204658 -0.324908 -0.398545 -0.237448 -0.066170 -0.172218 -0.261802 0.101015 0.274097 0.282328 0.237960 0.292253 0.265369 0.238593 0.236396 0.258734 0.383882
chargesum: 0.00000
title: Mulliken charges with hydrogens summed into heavy atoms:
elementType: Cl O O O C C C C C C C C C C C C C
charge: -0.063726 -0.281274 -0.062436 -0.217655 0.225797 0.121450 0.403593 -0.078987 -0.011332 0.033302 -0.032655 -0.133177 0.001145 -0.066170 0.064178 -0.003068 0.101015
polarizability: 2.18468996e+02 1.38200724e+01 1.64048819e+02 1.05057607e+01 6.30338456e+00 1.04902096e+02
1716.lowfreq: -6.7142 -5.2890 -0.0014 -0.0013 0.0024 3.3425 13.4848 28.9193 34.5774
frequency: 13.1751 28.8494 34.5736 61.1890 124.1432 159.2048 183.6433 199.7267 222.7097 266.6156 300.6613 342.2485 380.7672 407.0259 421.0135 437.1095 476.3896 514.7259 538.1816 570.3369 586.4854 592.4311 619.7318 659.8136 673.5971 681.2397 721.2899 764.2893 778.8871 781.7224 795.2356 862.0408 882.1787 888.1225 889.0090 969.8469 970.9268 981.2230 986.0788 997.0033 1040.6607 1063.0633 1087.1469 1107.6195 1159.5522 1163.7007 1175.6797 1179.0138 1227.7995 1268.1898 1281.3764 1304.4622 1376.7469 1386.7572 1420.1960 1428.2448 1455.7581 1476.4692 1577.3834 1581.0558 1604.2153 1607.9092 1652.5441 3140.1287 3149.4367 3157.6871 3169.6439 3176.5040 3176.9106 3185.9115 3187.4223 3530.1738
redmass: 8.5743 6.3423 10.7366 7.0121 4.5719 6.4036 5.6899 6.5583 5.0830 7.4034 6.4389 7.0131 11.1714 5.3875 3.7027 3.1071 5.4304 4.2507 5.1819 7.8249 1.6553 2.4449 5.9770 6.5610 2.5811 3.7864 4.8194 2.6893 1.4697 1.7610 5.1261 1.5275 2.3554 1.6977 1.6830 1.3346 1.3782 5.9357 4.9681 1.3563 2.2903 1.9195 1.5223 2.0545 1.6755 1.2743 1.3271 1.5301 4.1367 1.5404 1.3581 2.3607 8.6367 9.8577 2.9163 2.2771 2.3888 2.5572 6.9421 6.8201 6.6712 7.4013 8.8909 1.0867 1.0880 1.0910 1.0970 1.0931 1.0927 1.0988 1.0970 1.0642
irintensity: 1.2034 1.6704 1.2793 0.2709 0.6849 0.6509 0.4733 1.7631 2.4681 3.5105 0.4320 0.4574 8.6829 7.4307 16.4320 5.5170 4.6064 17.8741 1.9377 2.1506 88.0210 63.1345 4.4079 5.9648 28.3198 58.6503 3.8060 44.9228 42.6207 43.2551 35.9934 29.7087 83.6257 23.2259 25.0681 4.0088 11.6215 7.1895 315.2446 6.5125 8.6972 15.3027 15.5407 37.8497 78.5091 15.0604 2.3127 3.6320 371.8515 8.5987 46.6384 77.5181 9.0960 1.3199 26.0663 31.2911 229.0525 86.3918 58.2481 116.7940 30.1390 82.6464 285.7209 3.1564 10.5151 13.6803 7.3568 1.6958 0.9497 4.3904 6.0959 44.8429
temp: 298.150 k
press: 1.00000 atm
elementType: 17 8 8 8 6 6 6 6 6 6 6 6 6 6 6 6 6 1 1 1 1 1 1 1 1 1
symmnumber: 1
zpe: 486059.5 jmol-1
zpe.correction: 0.185130 hartree
zpe.thermalcorrener: 0.199728 hartree
zpe.thermalcorrenthalpy: 0.200673 hartree
zpe.thermalcorrgfe: 0.140325 hartree
zpe.sumelectzpe: -1185.323356 hartree
zpe.sumelectthermal: -1185.308758 hartree
zpe.sumelectthermalent: -1185.307814 hartree
zpe.sumelectthermalfe: -1185.368162 hartree
dipole: 1.3154 1.3930 -1.6178
dipole: 2.5076
quadrupole: -93.4901 -98.1308 -103.8229
quadrupole: 7.4485 9.3706 -0.4911
quadrupole: 4.9912 0.3505 -5.3417 7.4485 9.3706 -0.4911
hfenergy: -1185.5084865 hartree
pointgroup: C01 [X(C13H9Cl1O3)]
dipole: 0.5806758 0.7244356 -0.3336022 debye
dipolederiv: -0.2570944 0.0551489 0.1732868 0.1044065 -0.1360232 -0.2048587 0.3176854 -0.1811561 -0.6564793 -2.3749629 -0.186176 -0.1168772 -0.146257 -0.2410861 -0.0787659 -0.5199429 -0.0997542 -0.3361593 -1.2394656 0.5150953 0.026832 0.5027815 -0.5452291 0.0059188 -0.0218033 0.0062286 -0.4251482 -0.7499195 -0.1208548 0.0096459 -0.1288389 -0.9417678 -0.0497698 -0.0231117 -0.062705 -0.2870503 1.3613303 0.0494596 0.2066087 0.7102228 0.3973293 0.1093559 0.8370273 0.103587 0.1956322 -0.3002106 -0.0481156 -0.0310042 0.2298237 -0.6594963 -0.0033792 0.0007095 -0.0846204 -0.0162806 1.9493548 0.0866136 -0.033563 -0.3198291 0.071067 0.0140843 -0.1937281 0.011696 0.2681504 -0.2102245 -0.0843071 0.0251981 -0.473201 -0.2363023 -0.0859483 -0.1611208 -0.0433625 -0.161386 -0.0377674 0.1445375 0.055734 -0.1767146 0.1911569 -0.00319 0.0125643 0.0595457 -0.0783654 0.2550841 -0.0620668 0.0854612 0.0159914 0.1670492 0.0357183 0.1486503 0.0275618 -0.0725157 -0.5048235 0.0008707 0.0713321 0.1287793 -0.137247 -0.071638 0.3925735 -0.0474132 -0.304471 -0.4850623 -0.0306394 0.0204183 -0.0958828 -0.1504974 0.0756103 -0.1536821 0.0508343 -0.0345518 -0.1316465 0.1617608 0.0651023 0.2492533 -0.2153072 0.0709515 0.0300712 0.0551957 -0.1436351 0.5124702 -0.0721769 -0.1949848 -0.1679761 0.075138 0.3663655 -0.4631863 0.3332096 0.9989465 0.2408171 -0.0191393 -0.0760992 -0.0099764 -0.0931841 0.0937773 0.0042576 0.0867827 0.1342674 -0.1767299 -0.0107413 -0.0036319 0.0271949 -0.1720766 -0.0837224 0.081198 -0.0759525 -0.4046734 1.6067642 -0.2788097 -0.0291887 -0.4524571 1.7709381 0.0597526 0.0531058 0.0981035 0.2269712 0.007412 0.0682612 -0.0558765 0.0902825 0.0804358 -0.0036874 -0.0829036 -0.0057778 0.1202903 0.0182372 0.0419127 -0.0384668 0.0407524 0.1059349 0.0125339 -0.0371149 0.0158144 0.1459542 0.0837971 0.0198121 -0.0147598 -0.0130617 -0.0972695 -0.0237397 -0.004867 -0.0297182 0.1451787 0.0768384 -0.0103906 -0.0541908 0.0096672 0.137547 -0.0335417 -0.1057998 -0.0345375 0.0638687 0.0979993 0.0255119 0.055652 0.0208842 0.1496484 -0.0604999 0.0509113 -0.053579 0.0077312 -0.030467 -0.0802859 -0.0723977 -0.0709817 0.0305171 -0.0410876 -0.084884 -0.0486558 0.1324688 -0.0136259 -0.0295093 -0.0842793 -0.0261058 0.1346763 -0.0591836 -0.0886158 -0.0568729 -0.0087089 -0.0392268 0.011119 0.0256644 0.027044 0.1658126 -0.0297941 0.0341636 -0.0260578 0.1026783 0.3411222 -0.1468906 -0.0156158 -0.0758016 0.148236 -0.0112621 -0.0221574 0.0016036 0.3872871 unknown
polarizability: 221.9827427|-0.0839928|142.8745984|9.362235|26.8418857|122.56257 unknown
InChI: InChI=1S/C13H9ClO3/c14-9-4-3-5-10(8-9)17-12-7-2-1-6-11(12)13(15)16/h1-8,15H
charge 0 multiplicity 1
26 atoms
Cl -3.770767 1.011608 2.558489
O  -0.055114 -0.302505 -0.928212
O  3.609898 -2.207309 0.007497
O  1.330854 -2.599568 -0.158325
C  0.981135 0.412235 -0.299194
C  2.176028 -0.289473 0.033291
C  -1.41199 -0.094689 -0.598806
C  0.897295 1.814998 -0.134346
C  3.287102 0.459572 0.511267
C  2.004866 2.530604 0.362024
C  -1.830622 0.345473 0.679265
C  -2.345748 -0.438853 -1.601282
C  3.206634 1.854022 0.682388
C  -3.213938 0.446429 0.913429
C  -3.723276 -0.328185 -1.321284
C  -4.178941 0.122566 -0.058901
C  2.265833 -1.773619 -0.061522
H  -0.022305 2.336726 -0.416244
H  4.205684 -0.081306 0.751545
H  1.933498 3.616888 0.482741
H  -1.109655 0.580711 1.466052
H  -1.980391 -0.792964 -2.568741
H  4.070211 2.410904 1.058869
H  -4.455053 -0.593115 -2.091259
H  -5.245765 0.212669 0.160524
H  3.613628 -3.201419 -0.026864
