program: Gaussian 09
title: 000237239
version: EM64L-G09RevD.01
frameworkgroup: C1[X(C7H6FNO)]
method: RPBEPBE
basis: SDD
operation: Freq
keyword: #p
keyword: freq=noraman
keyword: PBEPBE/SDD
title: #p freq=noraman PBEPBE/SDD
converged: NO YES NO YES
title: Mulliken charges:
elementType: F O N C C C C C C C H H H H H H
charge: -0.205569 -0.249747 -0.403528 0.472024 -0.386336 -0.304070 -0.343575 -0.360091 0.320040 -0.068579 0.224906 0.311526 0.257738 0.258281 0.304708 0.172272
chargesum: 0.00000
title: Mulliken charges with hydrogens summed into heavy atoms:
elementType: F O N C C C C C C C
charge: -0.205569 -0.249747 -0.098820 0.472024 -0.161430 0.007456 -0.085837 -0.101810 0.320040 0.103692
polarizability: 1.28998798e+02 -2.13275894e+00 9.07078371e+01 1.37454155e-02 6.22406247e-03 3.43535870e+01
1716.lowfreq: -0.0008 -0.0007 -0.0005 5.3094 14.4911 20.1217 69.4804 129.2629 175.8652
frequency: 69.4670 129.2618 175.8647 271.5244 298.1554 397.8883 405.1315 420.7392 430.2959 524.5271 625.8680 641.3177 680.0326 712.2679 798.6914 807.4893 840.5037 845.8516 929.5677 946.4564 979.7727 1001.4588 1100.9152 1113.4813 1158.3146 1196.9543 1259.5296 1294.7735 1360.1751 1390.6966 1410.6580 1491.7629 1508.6685 1607.5684 1619.5183 1637.1917 2937.7049 3125.8322 3171.2706 3178.5412 3196.2775 3516.8997
redmass: 6.2447 4.5850 8.7731 3.6498 9.7293 5.2302 3.7558 3.4709 8.4435 2.5027 7.2293 1.1685 5.8500 3.7576 6.8755 1.3377 6.3480 1.5000 1.3601 1.5911 1.3081 2.9041 2.6222 1.4180 1.4801 1.8270 2.1811 1.3779 2.5293 1.6556 4.1477 2.1558 2.5799 6.6479 6.3771 4.8624 1.0865 1.0905 1.0910 1.0953 1.0964 1.0770
irintensity: 6.1869 7.3959 9.1884 18.8410 2.2538 3.5830 3.0292 3.3333 17.0348 24.4626 0.4655 73.1111 6.7213 0.1989 27.9819 30.6395 0.4966 90.3005 0.4180 1.1718 4.3831 4.7599 22.0128 20.6033 34.1710 62.0504 2.2129 12.5200 18.9789 56.7213 19.6598 28.0640 402.5782 10.5507 11.0207 226.8163 117.4972 14.1583 1.6426 2.2896 6.3576 14.0249
temp: 298.150 k
press: 1.00000 atm
elementType: 9 8 7 6 6 6 6 6 6 6 1 1 1 1 1 1
symmnumber: 1
zpe: 306297.0 jmol-1
zpe.correction: 0.116662 hartree
zpe.thermalcorrener: 0.124966 hartree
zpe.thermalcorrenthalpy: 0.125911 hartree
zpe.thermalcorrgfe: 0.083090 hartree
zpe.sumelectzpe: -499.452244 hartree
zpe.sumelectthermal: -499.443940 hartree
zpe.sumelectthermalent: -499.442995 hartree
zpe.sumelectthermalfe: -499.485816 hartree
dipole: 1.0285 4.2680 0.0014
dipole: 4.3902
quadrupole: -64.9901 -49.5509 -60.1592
quadrupole: 9.5878 0.0026 0.0005
quadrupole: -6.7567 8.6825 -1.9259 9.5878 0.0026 0.0005
hfenergy: -499.5689061 hartree
pointgroup: C01 [X(C7H6F1N1O1)]
dipole: -0.3697188 1.6872021 -0.0005439 debye
dipolederiv: -1.1761487 0.2128849 -0.0001949 0.2578339 -0.2612638 0.0000506 -0.0002152 0.0000498 -0.1486491 -0.6152223 -0.0384021 -0.0000227 -0.7128927 -0.9111639 -0.00005 0.0004153 0.0003202 -0.3549613 -1.5119298 -0.2305611 0.0000047 -0.2986038 -0.3529576 0.0000269 0.0000081 -0.0000433 -0.3249002 0.9469346 -0.1365565 0.0001184 -0.3596384 -0.030311 -0.0000217 0.0001829 -0.0000014 0.0886603 -0.1219425 0.083224 0.0000296 -0.1090713 0.0912752 -0.0000352 -0.0000189 0.0000127 -0.1951604 -0.0977233 -0.0516708 0.0000316 0.1656743 -0.010901 0.000025 -0.0000007 -0.000025 -0.1586132 -0.1033993 -0.0303452 0.0000099 0.2378987 -0.0236626 0.0000352 0.0000153 -0.0000084 -0.143744 -0.1830054 0.0732894 -0.0000077 -0.1476458 0.0549297 -0.0000325 -0.0000027 -0.0000016 -0.144923 1.1958025 -0.2491985 0.0002205 -0.2829872 0.239157 -0.0000605 0.0002312 -0.0000621 0.0730365 1.4072507 0.276058 -0.0000419 0.9796405 1.1945369 -0.0000478 -0.0006174 -0.0002622 0.1426406 0.0508843 0.0899082 -0.00003 0.0680393 -0.081933 0.0000214 -0.0000308 0.0000251 0.1693579 0.1313334 -0.0576209 -0.0000194 -0.0257094 0.086954 -0.0000066 -0.0000319 0.0000051 0.1849471 0.0154183 -0.0683937 -0.0000277 -0.0767823 0.0370366 -0.0000084 -0.0000259 -0.0000073 0.1822667 0.0786572 0.0360026 -0.0000186 0.0533067 -0.0211473 0.0000171 -0.0000177 0.0000139 0.1778393 0.1281868 -0.0278218 -0.0000266 0.0126516 0.1008497 0.000037 -0.0000828 0.0000097 0.3262123 -0.1450965 0.1192036 -0.0000251 0.2382857 -0.111399 0.0000496 0.0001911 -0.0000252 0.1259905 unknown
polarizability: 129.070774|1.3369584|90.6358613|0.0136134|-0.0065078|34.353587 unknown
InChI: InChI=1S/C7H6FNO/c8-6-1-3-7(4-2-6)9-5-10/h1-5,9H
charge 0 multiplicity 1
16 atoms
F  3.487873 -0.615539 0.000452
O  -3.14695 -1.124528 -0.000051
N  -1.934988 0.906932 -0.000673
C  -0.57595 0.47503 -0.000387
C  0.434529 1.474433 -0.000235
C  -0.2132 -0.90005 -0.000257
C  1.797044 1.116761 0.000045
C  1.150804 -1.260125 0.000028
C  2.125888 -0.249626 0.000171
C  -3.091371 0.134899 -0.000727
H  0.158467 2.536149 -0.000329
H  -0.994556 -1.661787 -0.000389
H  2.586449 1.873282 0.000167
H  1.453626 -2.311216 0.000131
H  -2.080471 1.920299 -0.000822
H  -4.002691 0.775786 -0.000523
