program: Gaussian 09
title: 000237238
version: EM64L-G09RevD.01
frameworkgroup: C1[X(C7H5ClFNO)]
method: RPBEPBE
basis: SDD
operation: Freq
keyword: #p
keyword: freq=noraman
keyword: PBEPBE/SDD
title: #p freq=noraman PBEPBE/SDD
converged: NO NO NO NO
title: Mulliken charges:
elementType: Cl F O N C C C C C C C H H H H H
charge: -0.004355 -0.178365 -0.243989 -0.410806 0.509702 -0.422148 -0.323236 -0.273933 -0.322023 0.417690 -0.062999 0.251304 0.314818 0.262552 0.310456 0.175331
chargesum: 0.00000
title: Mulliken charges with hydrogens summed into heavy atoms:
elementType: Cl F O N C C C C C C C
charge: -0.004355 -0.178365 -0.243989 -0.100350 0.509702 -0.170843 -0.008419 -0.273933 -0.059471 0.417690 0.112332
polarizability: 1.51448904e+02 -3.42588462e+00 1.00265023e+02 -3.81786504e-03 -4.73391863e-03 3.68244374e+01
1716.lowfreq: 0.0017 0.0023 0.0027 2.5398 5.1619 8.1573 58.0089 121.7595 158.4895
frequency: 57.9910 121.7590 158.4892 173.8511 202.6765 268.0427 278.9181 384.2787 402.6753 443.7627 446.7716 484.4090 585.2810 644.3185 657.6307 699.4768 716.3015 827.6995 833.6402 858.2429 861.5669 950.2658 973.5192 1027.7975 1106.4544 1142.2202 1205.5001 1246.9044 1283.1073 1349.1655 1388.3227 1397.7431 1486.9006 1503.6605 1592.0814 1613.2804 1639.8013 2933.7965 3141.2786 3168.8318 3202.3079 3519.6784
redmass: 9.1090 5.3804 9.1255 4.7614 15.7324 15.5564 3.9634 8.5889 4.2683 3.3123 8.7165 6.5128 3.5378 1.2365 7.4642 3.3393 6.7862 7.3627 1.3816 6.2594 1.5696 1.5826 1.3169 3.4994 2.9943 1.3189 1.9298 1.6298 2.4063 3.1486 1.3681 5.4217 2.8537 2.3335 6.3335 6.8582 4.8669 1.0869 1.0925 1.0912 1.0959 1.0771
irintensity: 10.2171 3.3060 7.9634 8.5558 3.2334 0.4498 11.7163 1.2487 7.6284 1.2264 24.7902 5.5145 15.1217 72.8121 7.8092 5.4594 22.2507 8.1686 27.1418 11.5309 69.6777 0.9013 4.0357 26.4803 51.5099 20.2947 74.1622 14.5040 1.0603 59.4110 49.9322 5.3795 146.3468 288.6258 58.3786 51.2732 207.8564 113.0745 3.0599 0.7903 7.5823 15.9212
temp: 298.150 k
press: 1.00000 atm
elementType: 17 9 8 7 6 6 6 6 6 6 6 1 1 1 1 1
symmnumber: 1
zpe: 281005.2 jmol-1
zpe.correction: 0.107029 hartree
zpe.thermalcorrener: 0.116645 hartree
zpe.thermalcorrenthalpy: 0.117589 hartree
zpe.thermalcorrgfe: 0.071212 hartree
zpe.sumelectzpe: -958.835606 hartree
zpe.sumelectthermal: -958.825990 hartree
zpe.sumelectthermalent: -958.825046 hartree
zpe.sumelectthermalfe: -958.871423 hartree
dipole: -1.4466 -3.4689 0.0008
dipole: 3.7585
quadrupole: -83.9592 -59.8292 -71.6617
quadrupole: 10.0042 -0.0019 -0.0001
quadrupole: -12.1425 11.9875 0.1550 10.0042 -0.0019 -0.0001
hfenergy: -958.9426352 hartree
pointgroup: C01 [X(C7H5Cl1F1N1O1)]
dipole: -0.6949841 -1.3051892 0.0003072 debye
dipolederiv: -0.5252936 0.2624956 0.0000174 0.3528257 -0.2886193 -0.0000093 0.0000109 -0.0000058 -0.0276254 -0.950606 -0.3646627 0.0000668 -0.382008 -0.3429028 0.0000323 0.0000729 0.0000343 -0.1204872 -0.7501729 0.0741777 0.000017 0.7503613 -0.7934922 -0.0000665 -0.000365 0.0001958 -0.3505079 -1.6800069 0.0698868 -0.0000749 0.0947336 -0.3178761 0.0000327 -0.0000353 -0.0000375 -0.3294227 0.953076 0.2434703 -0.0000298 0.5091145 0.1382831 -0.0000106 -0.0000817 -0.0000149 0.1026774 -0.3875965 -0.0251717 0.0000002 0.1589313 -0.0599597 -0.0000208 0.0000442 0.0000083 -0.1491098 -0.1527624 0.0452786 -0.0000168 -0.224718 -0.0586366 0.0000079 0.000003 -0.0000123 -0.168428 0.7635975 -0.3860844 -0.0000293 -0.676185 0.4079005 0.0000181 -0.0000258 0.0000014 -0.0648811 -0.0292324 -0.1570027 0.0000012 0.1283253 0.0489011 -0.0000128 -0.0000153 -0.0000026 -0.1291002 0.7638653 0.5464036 -0.0000687 0.5088162 0.2422787 -0.0000377 -0.0000673 -0.000042 0.09055 1.6686138 -0.2347614 0.0000899 -0.946416 1.021335 0.0000339 0.0005939 -0.000057 0.1479064 0.0825113 -0.0443601 0.0000097 -0.0413341 -0.0368322 0.000013 0.0000083 0.0000149 0.1762395 0.1264654 0.0555491 0.000009 0.0269571 0.1049191 -0.0000014 0.0000184 0.0000077 0.1893487 0.078048 -0.0079576 0.0000059 -0.0263554 -0.0190696 0.0000086 0.0000067 0.0000065 0.1775562 0.1284305 0.0297884 0.000012 0.001245 0.1124641 0.0000141 0.0000547 -0.0000009 0.3282433 -0.0889371 -0.1070495 -0.0000096 -0.2342935 -0.1586931 -0.0000017 -0.0002226 -0.0000959 0.1270409 unknown
polarizability: 150.3546181|-8.1577573|101.3593089|-0.0042462|-0.0043539|36.8244374 unknown
InChI: InChI=1S/C7H5ClFNO/c8-6-3-5(10-4-11)1-2-7(6)9/h1-4,10H
charge 0 multiplicity 1
16 atoms
Cl 3.095754 -1.705518 -0.0001
F  3.040485 1.335291 -0.000241
O  -3.591508 0.779809 -0.000234
N  -2.074746 -1.035843 0.000212
C  -0.804382 -0.392541 0.000088
C  0.348654 -1.222925 0.000052
C  -0.660801 1.022078 0.000024
C  1.629661 -0.646984 -0.000059
C  0.631943 1.583954 -0.000089
C  1.76576 0.755934 -0.000133
C  -3.340205 -0.454129 0.00027
H  0.255705 -2.314979 0.000118
H  -1.547562 1.657107 0.000078
H  0.771577 2.669259 -0.00014
H  -2.061602 -2.059384 0.000236
H  -4.137631 -1.232926 -0.000079
