program: Gaussian 09
title: 000237231
version: EM64L-G09RevD.01
frameworkgroup: C1[X(C13H17ClO3)]
method: RPBEPBE
basis: SDD
operation: Freq
keyword: #p
keyword: freq=noraman
keyword: PBEPBE/SDD
title: #p freq=noraman PBEPBE/SDD
converged: YES YES NO NO
title: Mulliken charges:
elementType: Cl O O O C C C C C C C C C C C C C H H H H H H H H H H H H H H H H H
charge: -0.051159 -0.310703 -0.233925 -0.436788 -0.030113 -0.408042 -0.360883 -0.357064 -0.133029 -0.395101 0.536574 -0.332214 -0.304963 -0.357465 -0.226014 -0.233645 -0.221412 0.219671 0.207243 0.196654 0.238207 0.201339 0.190563 0.229032 0.251617 0.214611 0.186630 0.187350 0.217198 0.262596 0.256875 0.231096 0.235661 0.329601
chargesum: 0.00000
title: Mulliken charges with hydrogens summed into heavy atoms:
elementType: Cl O O O C C C C C C C C C C C C C
charge: -0.051159 -0.310703 -0.233925 -0.107188 0.189558 -0.004145 0.078664 0.062531 0.118588 0.006140 0.536574 0.072334 -0.304963 -0.094868 0.030861 -0.002549 0.014249
polarizability: 1.93377808e+02 -1.18614528e+00 1.65466782e+02 9.78059609e+00 1.39272815e+01 1.06286277e+02
1716.lowfreq: -2.0471 -0.0015 -0.0011 0.0008 6.6323 13.1727 16.8096 25.0172 43.4355
frequency: 16.4932 24.9699 43.3551 56.2707 69.2760 94.3770 112.6796 136.1827 140.6882 172.2161 188.9784 226.8654 257.1283 261.2666 312.1783 328.8434 364.0506 393.2048 420.2822 457.1689 469.1479 472.2304 529.9833 603.6343 619.3105 672.9835 700.5182 725.9335 734.7487 760.9986 777.1708 820.0082 823.6467 851.5705 881.5335 901.4398 931.9418 948.5381 959.6689 972.2537 992.4381 1009.6845 1012.1023 1029.2207 1034.4596 1042.8687 1074.1177 1079.8167 1088.9038 1109.9829 1119.0312 1157.1080 1169.5262 1180.6130 1198.9501 1230.3292 1241.8235 1248.7567 1262.1313 1275.5007 1287.0552 1290.1283 1307.8911 1316.2433 1328.3667 1337.2882 1359.5136 1372.2516 1381.8483 1383.0663 1426.0195 1448.2059 1454.5937 1465.1021 1472.1400 1474.8318 1487.8470 1577.5529 1604.2441 2950.5634 2956.8741 2967.4107 2970.2774 2976.4241 2982.9313 3013.6017 3025.9318 3039.1824 3051.1143 3074.4369 3102.2104 3136.2843 3152.7430 3166.9860 3176.1392 3560.1316
redmass: 6.6876 7.1818 2.0921 3.2183 4.9600 3.1728 4.4265 2.6426 3.2195 4.0631 5.2269 3.2394 6.1273 5.3602 1.1620 5.2818 3.6861 8.6523 4.5290 3.7117 4.0378 2.3787 4.1980 5.8809 3.4163 6.8195 6.6301 4.8567 1.1906 1.2692 1.4979 2.5764 2.4553 4.9415 1.5287 1.5628 3.5671 4.8903 1.3920 2.8188 1.3515 2.5973 3.9860 4.6676 3.5103 2.4266 2.3846 2.3614 1.6848 1.8727 1.6617 1.7002 1.0692 1.2506 1.8865 1.2662 1.3579 1.3372 1.4654 1.2506 1.1107 1.1381 1.2366 1.2031 1.3627 1.2975 1.4520 1.7339 4.2939 1.3573 2.1600 1.0989 2.4798 1.0716 1.0924 1.0854 1.0948 6.3888 7.2212 1.0691 1.0629 1.0610 1.0731 1.0632 1.0763 1.0939 1.0981 1.0873 1.1014 1.0979 1.0986 1.0859 1.0907 1.0940 1.0997 1.0661
irintensity: 0.0654 0.5189 1.0862 5.6959 3.9361 2.9037 0.6431 1.8990 2.3574 0.0502 1.0443 6.4887 4.4203 0.1719 142.9417 8.9672 9.5329 11.1999 2.6703 3.7018 11.9657 9.3591 1.9065 15.8518 4.9024 17.5819 7.5041 6.7219 3.3537 93.1897 18.2330 5.4388 23.0017 43.0912 8.5335 14.8948 10.6401 56.8011 8.7339 20.1991 3.9372 96.6863 53.0080 92.2574 25.9140 27.5233 11.0428 30.7899 15.1469 9.3049 13.6194 0.4350 5.5761 8.2954 24.3395 21.6672 0.9142 23.6774 21.5824 5.6386 0.0793 0.5435 10.8064 9.2244 15.8537 2.8194 4.4950 6.7843 6.1543 19.0095 31.8227 2.2483 23.2251 0.7670 6.2204 1.9365 14.3917 18.1295 9.1344 56.7950 15.7824 2.1259 29.7729 36.3559 84.2845 13.3626 15.6504 22.3143 57.7238 62.4499 25.9272 2.2923 9.2284 8.5697 14.9817 7.3130
temp: 298.150 k
press: 1.00000 atm
elementType: 17 8 8 8 6 6 6 6 6 6 6 6 6 6 6 6 6 1 1 1 1 1 1 1 1 1 1 1 1 1 1 1 1 1
symmnumber: 1
zpe: 722954.4 jmol-1
zpe.correction: 0.275359 hartree
zpe.thermalcorrener: 0.292623 hartree
zpe.thermalcorrenthalpy: 0.293567 hartree
zpe.thermalcorrgfe: 0.227126 hartree
zpe.sumelectzpe: -1189.978281 hartree
zpe.sumelectthermal: -1189.961016 hartree
zpe.sumelectthermalent: -1189.960072 hartree
zpe.sumelectthermalfe: -1190.026513 hartree
dipole: 0.1767 1.9827 1.8839
dipole: 2.7407
quadrupole: -133.4443 -97.4959 -108.7947
quadrupole: -9.8613 3.9149 2.1248
quadrupole: -20.1993 15.7490 4.4503 -9.8613 3.9149 2.1248
hfenergy: -1190.2536393 hartree
pointgroup: C01 [X(C13H17Cl1O3)]
dipole: -0.0221552 0.7200352 0.8023446 debye
polarizability: 192.9168382|0.2880686|162.6905615|10.4606025|19.4106669|109.5234669 unknown
InChI: InChI=1S/C13H17ClO3/c14-12-7-2-1-6-11(12)13-16-9-10(17-13)5-3-4-8-15/h1-2,6-7,10,13,15H,3-5,8-9H2
charge 0 multiplicity 1
34 atoms
Cl -4.175261 -1.481302 -1.161339
O  0.310696 -0.762179 -0.723721
O  -1.175121 -2.250045 0.373644
O  6.510968 1.78295 -0.188354
C  1.100179 -1.627789 0.21101
C  2.253572 -0.806082 0.790946
C  0.026694 -2.083863 1.216537
C  3.26414 -0.337551 -0.280142
C  -1.099817 -1.164495 -0.640281
C  4.39317 0.534949 0.311429
C  -1.972184 0.025523 -0.254969
C  5.410863 0.983529 -0.753463
C  -3.37577 -0.006776 -0.425957
C  -1.41084 1.202593 0.299302
C  -4.208852 1.063495 -0.049687
C  -2.223172 2.289439 0.687563
C  -3.624363 2.219664 0.515953
H  1.483051 -2.494903 -0.365687
H  2.776059 -1.424115 1.550181
H  1.833052 0.071287 1.322575
H  0.227284 -3.064773 1.67362
H  -0.139425 -1.318485 2.002533
H  3.707152 -1.224508 -0.778849
H  2.717324 0.222219 -1.063572
H  -1.433986 -1.625397 -1.586392
H  4.934295 -0.020725 1.102749
H  3.948762 1.430723 0.79683
H  4.895382 1.539103 -1.567349
H  5.915268 0.109482 -1.199734
H  -0.321533 1.250368 0.389917
H  -5.290368 0.994733 -0.197941
H  -1.766094 3.189191 1.112845
H  -4.264166 3.058262 0.810705
H  6.131441 2.601178 0.221296
