program: Gaussian 09
title: 000021208
version: EM64L-G09RevD.01
frameworkgroup: C1[X(C6H7N3O2)]
method: RPBEPBE
basis: SDD
operation: Freq
keyword: #pfreq=noraman
keyword: PBEPBE/SDD
title: #p freq=noraman PBEPBE/SDD
converged: YES YES NO YES
title: Mulliken charges:
elementType: O O N N N C C C C C C H H H H H H H
charge: -0.239627 -0.292362 -0.677813 0.024584 -0.691058 0.407506 0.216806 0.595404 -0.589729 -0.333803 -0.446775 0.216073 0.281830 0.227675 0.303961 0.365660 0.318524 0.313145
chargesum: 0.00000
title: Mulliken charges with hydrogens summed into heavy atoms:
elementType: O O N N N C C C C C C
charge: -0.239627 -0.292362 -0.008192 0.024584 -0.059389 0.407506 0.216806 0.595404 -0.373657 -0.051973 -0.219099
polarizability: 1.69403489e+02 -1.79750706e+00 1.14149730e+02 -5.49946628e-04 -3.79218674e-03 3.82430176e+01
1716.lowfreq: -9.8321 -7.6148 -3.4159 0.0004 0.0006 0.0007 88.3929 101.0682 207.5990
frequency: 88.3927 101.0678 207.5988 250.7817 278.4961 342.6820 363.7083 408.3971 409.5912 428.2730 449.6512 474.7397 519.7501 572.6580 606.3606 628.9773 660.7967 699.8233 742.0253 762.3477 765.9871 796.4579 832.9698 951.4939 971.4841 1018.9383 1078.8527 1097.0745 1147.4376 1220.2838 1253.2981 1275.6294 1323.8364 1359.5216 1437.3326 1502.5403 1508.6297 1554.0747 1591.8277 1644.9006 1651.3916 3121.2064 3144.8120 3181.2767 3373.5061 3560.0055 3644.3053 3699.3644
redmass: 7.7959 6.4121 4.1701 5.9552 4.4826 3.2090 9.1745 4.6365 1.0247 1.6001 1.8879 1.1809 5.0062 4.8666 7.2761 5.7631 3.1703 2.9490 6.2750 8.6030 1.2048 1.4689 2.0178 2.6518 1.3002 1.6725 2.7574 1.5860 1.6041 2.9845 2.1711 2.3507 3.1682 2.8407 5.7936 3.7818 4.2016 2.0647 2.2093 1.8696 2.1721 1.0911 1.0896 1.0950 1.0567 1.0453 1.0935 1.1040
irintensity: 0.0098 0.0651 7.7402 1.0384 0.1624 8.2430 1.2538 1.0311 2.1437 216.4390 52.1823 182.4742 2.2568 1.5173 10.5413 0.1656 31.4804 10.6916 0.2083 1.4402 117.7702 22.4895 92.7922 8.1165 1.2079 6.1748 5.3875 9.7714 162.0123 226.4420 61.2764 270.2603 143.9614 16.9537 11.4790 43.5306 4.3023 50.4155 269.4632 75.4456 573.9757 18.3614 8.8450 4.9677 78.0563 118.5447 51.8070 25.9192
temp: 298.150 k
press: 1.00000 atm
elementType: 8 8 7 7 7 6 6 6 6 6 6 1 1 1 1 1 1 1
symmnumber: 1
zpe: 351131.2 jmol-1
zpe.correction: 0.133739 hartree
zpe.thermalcorrener: 0.143286 hartree
zpe.thermalcorrenthalpy: 0.144230 hartree
zpe.thermalcorrgfe: 0.099291 hartree
zpe.sumelectzpe: -546.681644 hartree
zpe.sumelectthermal: -546.672097 hartree
zpe.sumelectthermalent: -546.671153 hartree
zpe.sumelectthermalfe: -546.716091 hartree
dipole: 8.1684 2.5389 0.0020
dipole: 8.5539
quadrupole: -60.7973 -52.7417 -67.8621
quadrupole: -4.4222 -0.0057 0.0078
quadrupole: -0.3302 7.7253 -7.3951 -4.4222 -0.0057 0.0078
hfenergy: -546.8153827 hartree
pointgroup: C01 [X(C6H7N3O2)]
dipole: -3.2125765 -1.0024939 0.0001796 debye
dipolederiv: -0.7606414 -0.2616306 -0.0001422 -0.6007752 -0.8476297 -0.0002361 -0.0003785 -0.000346 -0.2551083 -0.9124272 0.1855224 -0.0000714 0.5122994 -0.6720251 -0.0001937 -0.0000532 0.0000154 -0.2982235 -0.4915848 0.4528671 0.0002469 0.3830855 -1.081128 0.0002382 0.0002316 -0.0000891 -0.6506557 2.2094175 0.2531389 0.000284 0.2161109 1.1049056 0.0005387 0.0004655 0.0005646 0.192981 -1.7494965 0.0818597 -0.0002405 -0.1048232 -0.1462539 -0.0000317 -0.0002296 -0.0000284 -0.7178647 0.9368467 -0.5276367 0.0002233 -0.0729635 1.0511352 -0.0002596 0.0004033 -0.0004554 0.1995645 -1.2864633 -0.3184698 -0.0001889 0.1117811 -0.3686646 0.0000002 -0.0001334 -0.0001233 -0.0683991 1.842057 -0.118318 0.0003839 0.2311814 0.541666 0.0000178 0.000383 -0.000027 0.2064053 -0.7161947 0.4425206 -0.000169 0.4212988 -0.2043072 0.0000737 -0.0001396 0.0002476 -0.3269579 0.6946732 -0.0331705 0.0001489 -0.4519921 0.0248978 -0.0000917 0.0000003 -0.0000593 -0.0469001 -0.7425543 -0.1188718 -0.0000835 -0.5137184 -0.1120813 -0.0001082 -0.0000311 -0.0000264 -0.2719368 0.0008623 -0.0593191 -0.000029 -0.0892921 -0.0945911 0.0000132 -0.0000672 0.00006 0.1847201 0.1011306 -0.0747389 -0.0000021 -0.0024587 0.05391 0.0000183 -0.0000141 -0.0000142 0.1591942 -0.0188894 0.0995927 -0.0000493 0.0758904 -0.0393111 0.000029 -0.0000402 0.000047 0.1765029 0.1442622 -0.0713319 -0.0001613 -0.0588283 0.2225102 0.0000292 -0.000153 0.0001404 0.3703089 0.2573857 0.073401 -0.0000827 -0.0607376 0.3192465 -0.0000554 -0.0001682 0.0000855 0.3755052 0.2583334 -0.0161621 -0.0000321 -0.0704518 0.1357897 -0.0000077 -0.0000478 -0.0000061 0.3855923 0.233283 0.0107472 -0.0000351 0.0743935 0.1119308 0.0000257 -0.0000278 0.0000147 0.3852718 unknown
polarizability: 169.4074553|-1.735387|114.1457588|0.0270063|-0.0000781|38.243023 unknown
InChI: InChI=1S/C6H7N3O2/c7-4-1-2-6(9(10)11)5(8)3-4/h1-3H,7-8H2
charge 0 multiplicity 1
18 atoms
O  2.601825 1.566892 0.001047
O  2.84578 -0.70075 0.000076
N  0.720853 -2.238016 0.000717
N  2.084353 0.377285 0.000312
N  -3.575917 0.048573 -0.000683
C  0.001545 -1.065689 0.000214
C  0.649629 0.229069 0.000234
C  -2.188857 0.093466 -0.000365
C  -1.42213 -1.092971 -0.000163
C  -0.1341 1.417763 0.000053
C  -1.523384 1.369211 -0.000237
H  -1.927216 -2.066838 -0.000196
H  0.400981 2.371128 0.000075
H  -2.11283 2.292213 -0.00042
H  0.244843 -3.136455 0.000631
H  1.74642 -2.153201 0.001924
H  -4.121836 0.905672 -0.000849
H  -4.07486 -0.836852 -0.000769
