program: Gaussian 09
title: 000237215
version: EM64L-G09RevD.01
frameworkgroup: C1[X(C13H26O2)]
method: RPBEPBE
basis: SDD
operation: Freq
keyword: #pfreq=noraman
keyword: PBEPBE/SDD
title: #p freq=noraman PBEPBE/SDD
converged: YES YES NO NO
title: Mulliken charges:
elementType: O O C C C C C C C C C C C C C H H H H H H H H H H H H H H H H H H H H H H H H H H
charge: -0.323412 -0.276740 0.379603 -0.038876 0.420361 -0.429126 -0.089948 -0.786694 -0.785191 -0.409231 -0.758344 -0.717998 -0.725621 -0.367307 -0.696977 0.182270 0.204814 0.221076 0.215526 0.237681 0.234884 0.209585 0.217693 0.213635 0.230506 0.204093 0.199876 0.226082 0.229488 0.222589 0.195431 0.205567 0.251214 0.208319 0.216604 0.215480 0.229441 0.196818 0.211044 0.209222 0.216565
chargesum: 0.00000
title: Mulliken charges with hydrogens summed into heavy atoms:
elementType: O O C C C C C C C C C C C C C
charge: -0.323412 -0.276740 0.379603 0.143394 0.420361 -0.003237 0.125578 -0.104544 -0.123358 -0.005262 -0.080185 -0.065786 -0.085219 0.058953 -0.060146
polarizability: 1.65346470e+02 -2.56201265e+00 1.42698176e+02 -2.28583245e+00 2.56597944e+00 1.30038236e+02
1716.lowfreq: -17.9000 -8.7701 -0.0008 -0.0007 -0.0005 10.7507 38.9704 58.5381 73.0661
frequency: 38.0423 58.4771 72.8972 92.3567 105.3056 128.7772 160.2769 184.7022 209.3273 218.5147 223.0261 232.7790 238.8543 252.2148 263.4214 269.4102 295.1868 309.3987 314.2143 335.7056 358.2764 391.8614 402.8250 409.3702 430.9913 476.3761 504.0064 524.3271 548.1373 638.1815 741.8949 745.6125 759.3850 807.0825 849.7713 863.5167 886.6929 893.2851 915.4424 918.8907 925.2869 935.3254 943.6154 956.4874 964.4614 975.4022 1006.7657 1015.5280 1029.5705 1044.7487 1082.7159 1115.6978 1124.4444 1140.7046 1176.0420 1184.5245 1190.2362 1208.5891 1216.9021 1228.3398 1256.9672 1263.4455 1283.7513 1289.6682 1302.3157 1305.2076 1332.3788 1346.3186 1351.4915 1355.1971 1371.9484 1377.6551 1383.1119 1389.0527 1391.3196 1398.2008 1445.9245 1456.4753 1459.4984 1463.9329 1467.0708 1470.1367 1472.4225 1476.6229 1477.2020 1477.8223 1479.6720 1483.2738 1487.1826 1491.1126 1497.8611 2947.6242 2970.0906 2970.7152 2971.5861 2975.2422 2976.4313 2980.4840 2983.5994 2990.8977 2993.5907 3002.9319 3031.1404 3051.1047 3057.2944 3058.4999 3063.9426 3068.0107 3069.1202 3070.9378 3074.3321 3080.3214 3085.2560 3092.6398 3098.9315 3104.8116 3110.0851
redmass: 2.9754 2.7258 1.7333 2.6509 2.6764 2.8330 1.1741 2.3287 1.6041 1.4229 1.6450 1.2202 1.1922 1.1651 2.1504 1.8542 1.9325 2.4215 2.8156 2.7919 2.2917 2.7963 2.7802 2.4602 3.3143 3.3039 2.8969 2.8715 3.8104 4.5570 1.7839 1.7730 3.1340 3.2528 1.7625 1.6904 1.9420 2.2479 1.6708 2.0554 1.4677 1.9412 1.5730 1.5831 2.0352 1.6880 2.1593 1.3989 2.4069 2.2762 2.0876 2.1693 2.2500 2.2081 1.9780 1.9917 2.3264 2.3561 2.9477 2.0785 1.4451 1.4439 1.4242 1.3810 1.3032 1.3320 1.2917 1.4141 1.4241 1.3889 1.2082 1.2023 1.2541 1.2144 1.2129 1.1986 1.0777 1.0720 1.0600 1.0538 1.0522 1.0569 1.0503 1.0475 1.0438 1.0497 1.0506 1.0513 1.0833 1.0562 1.0533 1.0821 1.0357 1.0383 1.0375 1.0394 1.0410 1.0565 1.0604 1.0605 1.0817 1.0359 1.0974 1.1015 1.0988 1.0988 1.0991 1.0982 1.1008 1.0990 1.1022 1.0997 1.0984 1.0963 1.0992 1.0977 1.0998
irintensity: 0.2085 0.0561 0.1661 0.1881 0.1826 0.7472 0.1223 0.9578 1.0701 1.2037 1.3395 0.1584 0.2447 0.2656 0.3309 0.2942 0.5665 0.8347 1.5163 1.5714 1.2541 1.5648 8.6926 3.7174 6.0986 5.3178 4.9962 5.3706 0.9836 2.7570 9.5264 1.5846 1.9684 36.9636 3.3873 2.2159 7.1809 13.1114 11.8378 7.5671 14.8185 1.8889 13.3292 11.5138 14.1706 15.4254 45.7290 2.9294 146.7576 3.1967 9.0928 1.3685 34.3642 10.8339 24.2343 12.2034 35.5489 5.6875 8.0852 41.3565 9.6969 6.4190 3.7851 12.9298 11.5051 9.9562 0.4755 2.7081 2.0672 6.8828 13.1032 20.8815 46.1666 14.4051 20.9490 20.5095 3.3555 6.7153 1.6919 4.8113 7.9861 13.0352 1.2504 5.2380 11.4895 6.0088 3.2289 17.0198 12.8023 2.3960 28.8409 18.9753 43.1281 29.3390 16.1435 14.6562 56.9676 36.8324 4.3192 50.3909 35.2643 13.6838 3.5108 1.7619 11.1178 11.4185 35.6556 78.5478 50.3388 45.6892 97.5962 36.1885 45.1997 25.8286 32.2997 21.4386 21.9483
temp: 298.150 k
press: 1.00000 atm
elementType: 8 8 6 6 6 6 6 6 6 6 6 6 6 6 6 1 1 1 1 1 1 1 1 1 1 1 1 1 1 1 1 1 1 1 1 1 1 1 1 1 1
symmnumber: 1
zpe: 962503.8 jmol-1
zpe.correction: 0.366598 hartree
zpe.thermalcorrener: 0.385000 hartree
zpe.thermalcorrenthalpy: 0.385944 hartree
zpe.thermalcorrgfe: 0.321949 hartree
zpe.sumelectzpe: -660.167029 hartree
zpe.sumelectthermal: -660.148627 hartree
zpe.sumelectthermalent: -660.147683 hartree
zpe.sumelectthermalfe: -660.211678 hartree
dipole: 0.8306 0.2420 -0.4433
dipole: 0.9721
quadrupole: -92.2320 -97.0588 -95.5722
quadrupole: -0.9030 -1.0268 3.3919
quadrupole: 2.7223 -2.1044 -0.6179 -0.9030 -1.0268 3.3919
hfenergy: -660.5336272 hartree
pointgroup: C01 [X(C13H26O2)]
dipole: -0.3305005 -0.088665 -0.1708508 debye
polarizability: 165.2080891|-3.1894128|142.772862|2.0395753|-2.8225943|130.1019303 unknown
InChI: InChI=1S/C13H26O2/c1-7-8-13(6)14-9-12(4,5)11(15-13)10(2)3/h10-11H,7-9H2,1-6H3
charge 0 multiplicity 1
41 atoms
O  0.331068 -0.50312 -0.110766
O  0.592775 1.680999 0.866156
C  -1.523582 1.129711 -0.370629
C  -1.112949 -0.287766 0.192519
C  1.224608 0.343819 0.702501
C  -0.234489 2.016024 -0.304861
C  -1.848492 -1.540443 -0.348127
C  -2.608598 1.766721 0.536198
C  -1.974783 1.096967 -1.850806
C  2.53923 0.468185 -0.094704
C  1.403782 -0.197788 2.12689
C  -1.220228 -2.829338 0.238195
C  -3.365403 -1.522163 -0.03312
C  3.251054 -0.873773 -0.382123
C  4.490394 -0.688845 -1.2841
H  -1.239922 -0.259952 1.297318
H  0.354005 1.901149 -1.23695
H  -0.497633 3.079677 -0.173706
H  -1.713681 -1.564108 -1.447997
H  -3.50608 1.131581 0.627348
H  -2.205001 1.938369 1.551868
H  -2.927969 2.744808 0.128241
H  -2.954466 0.604918 -1.979763
H  -2.069504 2.128307 -2.242489
H  -1.234679 0.564536 -2.476346
H  3.210757 1.143371 0.469986
H  2.311066 0.966783 -1.057012
H  1.83817 -1.210421 2.103003
H  2.071937 0.468905 2.698662
H  0.43528 -0.239698 2.652875
H  -1.340442 -2.857463 1.339322
H  -1.72044 -3.723836 -0.177801
H  -0.144255 -2.884849 0.00923
H  -3.540053 -1.433695 1.056627
H  -3.826463 -2.469512 -0.368158
H  -3.900169 -0.697276 -0.533468
H  2.532141 -1.562167 -0.864017
H  3.56039 -1.34769 0.570148
H  4.206477 -0.261422 -2.264492
H  5.224516 -0.002721 -0.820119
H  4.999631 -1.652184 -1.470934
