program: Gaussian 09
title: 000237214
version: EM64L-G09RevD.01
frameworkgroup: C1[X(C10H18O4)]
method: RPBEPBE
basis: SDD
operation: Freq
keyword: #pfreq=noraman
keyword: PBEPBE/SDD
title: #p freq=noraman PBEPBE/SDD
converged: YES YES NO NO
title: Mulliken charges:
elementType: O O O O C C C C C C C C C C H H H H H H H H H H H H H H H H H H
charge: -0.298869 -0.279640 -0.218053 -0.234266 -0.041021 0.366188 -0.431527 -0.349644 -0.374865 -0.366940 -0.692029 -0.693609 -0.337128 0.009155 0.207610 0.215082 0.224104 0.231520 0.196081 0.210961 0.194082 0.233065 0.214556 0.215721 0.229830 0.224004 0.232629 0.223452 0.214779 0.228944 0.236504 0.209324
chargesum: 0.00000
title: Mulliken charges with hydrogens summed into heavy atoms:
elementType: O O O O C C C C C C C C C C
charge: -0.298869 -0.279640 -0.218053 -0.234266 0.166589 0.366188 0.007660 0.077957 0.030178 0.080681 -0.022474 -0.022749 0.128320 0.218479
polarizability: 1.54386507e+02 2.40077164e+00 1.07947904e+02 4.34668775e-01 -7.23235715e-02 9.85729848e+01
1716.lowfreq: -14.2472 -6.8612 -0.0003 -0.0001 0.0003 6.7467 7.7142 23.8050 32.8001
frequency: -12.6752 23.4682 32.6937 56.3625 75.9608 110.5943 121.9291 149.8654 168.7402 176.0450 199.6434 220.1622 276.9652 290.6870 322.7192 329.6196 360.3730 414.9464 463.3399 473.1283 483.6237 607.4479 619.2291 700.6635 724.9213 748.9793 768.4436 794.5191 850.0856 862.4744 899.3226 918.4437 930.3866 960.1465 965.6758 980.7877 998.2672 1011.0482 1032.6277 1053.3620 1079.7679 1088.8734 1121.3016 1139.9229 1143.4551 1173.6580 1200.2356 1215.5577 1240.0721 1243.4943 1255.6801 1287.9130 1293.0637 1294.1235 1305.6606 1327.7652 1342.4304 1356.4672 1368.6128 1371.9500 1375.1822 1387.0640 1448.8882 1450.4692 1454.7860 1465.8378 1467.1449 1468.7869 1470.5465 1473.7633 1488.0406 1623.7769 2948.2437 2961.9338 2963.7717 2991.3203 2995.4307 2996.3781 2999.7257 3007.1082 3021.8107 3042.0402 3050.1830 3062.0592 3090.4643 3096.5070 3102.5027 3104.8289 3105.0072 3108.7106
redmass: 3.5988 4.8872 7.1133 3.6987 4.3733 2.2415 2.3008 2.2632 1.1590 2.3917 2.5674 1.2220 3.1512 2.9904 3.6626 2.6425 2.9284 2.6091 3.1512 3.9166 2.7945 4.4550 3.7278 3.8094 5.6010 1.0990 4.1278 1.3129 5.4163 2.8019 1.6839 1.4836 2.3416 1.6080 2.2108 1.3208 3.3363 1.9543 3.6873 3.5775 2.9946 5.2775 1.9050 2.0483 1.9385 1.4796 1.4294 2.1289 2.6750 1.4693 1.2689 1.2297 1.0608 1.1842 1.2129 1.3057 1.1264 1.4253 1.6751 1.3689 1.3056 1.2319 1.0480 1.0514 1.0966 1.0798 1.0653 1.0570 1.0705 1.0883 1.1002 7.7758 1.0811 1.0598 1.0698 1.0599 1.0354 1.0590 1.0354 1.0998 1.0587 1.0917 1.1030 1.1036 1.0976 1.1002 1.1005 1.0998 1.1078 1.1005
irintensity: 1.3479 1.1117 2.3496 0.3060 4.1418 0.9390 0.1439 2.9239 0.5149 0.5659 1.2658 0.3050 7.8712 16.6674 0.6344 1.2029 4.8729 11.1246 11.7853 15.2682 8.6848 0.7905 3.3983 9.5402 13.9442 8.1268 46.0969 0.9721 9.0929 9.6492 6.1822 0.5520 0.9614 3.0587 5.1849 0.4851 133.1015 26.5499 5.4049 13.1191 57.4155 238.2068 9.7667 33.6992 30.6997 12.2539 28.5219 94.9038 34.3246 37.9909 8.0493 3.0558 0.0773 0.5633 1.2266 3.9029 6.2768 0.6876 3.4323 6.0923 42.9330 22.7670 0.2031 4.0840 8.9353 5.3477 1.7700 12.9075 3.4487 2.2860 18.5630 234.3284 27.2494 18.7556 72.9513 9.2762 13.4211 36.3526 13.4854 8.3315 42.9321 58.3539 2.6412 57.8387 28.6352 0.0252 21.1090 37.0547 28.6037 35.5906
temp: 298.150 k
press: 1.00000 atm
elementType: 8 8 8 8 6 6 6 6 6 6 6 6 6 6 1 1 1 1 1 1 1 1 1 1 1 1 1 1 1 1 1 1
symmnumber: 1
zpe: 707292.2 jmol-1
zpe.correction: 0.269393 hartree
zpe.thermalcorrener: 0.284678 hartree
zpe.thermalcorrenthalpy: 0.285623 hartree
zpe.thermalcorrgfe: 0.225128 hartree
zpe.sumelectzpe: -691.603701 hartree
zpe.sumelectthermal: -691.588416 hartree
zpe.sumelectthermalent: -691.587472 hartree
zpe.sumelectthermalfe: -691.647967 hartree
dipole: 0.1525 -1.8078 -0.0981
dipole: 1.8169
quadrupole: -89.2543 -88.4538 -87.3878
quadrupole: -7.1521 0.5016 -3.9554
quadrupole: -0.8890 -0.0885 0.9776 -7.1521 0.5016 -3.9554
hfenergy: -691.8730946 hartree
pointgroup: C01 [X(C10H18O4)]
dipole: 0.0800185 0.0817837 -0.7055973 debye
polarizability: 154.1390673|1.6288403|98.6368031|3.9040542|-0.3203638|108.1315253 unknown
InChI: InChI=1S/C10H18O4/c1-10(2)13-7-9(14-10)5-3-4-6-12-8-11/h8-9H,3-7H2,1-2H3
charge 0 multiplicity 1
32 atoms
O  -2.672104 0.859607 -0.248598
O  -3.349317 -1.358529 0.278205
O  4.821453 0.548463 -0.410243
O  4.914889 -0.083844 1.848492
C  -1.541627 -0.063189 -0.534001
C  -3.856384 0.0381 0.138508
C  -0.233373 0.666255 -0.215398
C  -1.879414 -1.273379 0.361166
C  1.020018 -0.17852 -0.544419
C  2.328334 0.600106 -0.272897
C  -4.368265 0.567108 1.481961
C  -4.900965 0.033593 -0.979672
C  3.564777 -0.243768 -0.609074
C  5.367145 0.53471 0.86423
H  -1.572495 -0.360713 -1.604493
H  -0.234711 0.950162 0.854951
H  -0.209628 1.608156 -0.796333
H  -1.483779 -2.234549 -0.002841
H  -1.545667 -1.093514 1.404998
H  1.016257 -1.108977 0.05965
H  0.986517 -0.490447 -1.609189
H  2.368389 0.897038 0.792145
H  2.343559 1.527704 -0.876756
H  -5.275623 0.018552 1.78816
H  -3.595717 0.441467 2.259122
H  -4.609699 1.64105 1.398818
H  -4.434973 -0.274295 -1.930253
H  -5.711551 -0.675922 -0.738511
H  -5.332953 1.041599 -1.102552
H  3.597189 -0.519473 -1.675735
H  3.61509 -1.149319 0.022702
H  6.278829 1.161366 0.857958
