program: Gaussian 09
title: 000237225
version: EM64L-G09RevD.01
frameworkgroup: C1[X(C16H32O4)]
method: RPBEPBE
basis: SDD
operation: Freq
keyword: #pfreq=noraman
keyword: PBEPBE/SDD
title: #p freq=noraman PBEPBE/SDD
converged: YES YES NO NO
title: Mulliken charges:
elementType: O O O O C C C C C C C C C C C C C C C C H H H H H H H H H H H H H H H H H H H H H H H H H H H H H H H H
charge: -0.273716 -0.246143 -0.283883 -0.282904 -0.140169 -0.425602 -0.036722 -0.400140 -0.720988 -0.722627 0.222111 -0.706310 -0.306290 -0.216630 -0.370595 -0.242962 -0.347091 -0.260751 -0.272665 -0.685543 0.234791 0.213517 0.194382 0.248824 0.223436 0.203024 0.217860 0.203275 0.204247 0.232796 0.205847 0.200505 0.216033 0.209481 0.229393 0.257027 0.212080 0.191780 0.203521 0.205822 0.206099 0.183037 0.182475 0.192593 0.192877 0.204659 0.203324 0.201619 0.206089 0.211511 0.216181 0.211511
chargesum: 0.00000
title: Mulliken charges with hydrogens summed into heavy atoms:
elementType: O O O O C C C C C C C C C C C C C C C C
charge: -0.273716 -0.246143 -0.283883 -0.282904 0.094622 -0.017703 0.212102 0.026321 -0.095606 -0.083478 0.222111 -0.051403 0.162817 0.178671 0.041326 0.122550 0.038379 0.147232 0.135044 -0.046340
polarizability: 2.29478405e+02 4.77832143e+00 1.84333306e+02 -3.84659350e+00 4.39720707e+00 1.57010587e+02
1716.lowfreq: -9.1737 -4.2651 -3.1212 -0.0003 0.0007 0.0011 10.1130 13.9531 24.1667
frequency: 7.8298 13.2266 23.8755 31.1118 34.7321 47.3441 48.8031 67.7042 68.6573 72.2270 88.7596 108.1175 114.8848 121.1465 125.1955 137.9568 147.3250 168.9618 193.4929 209.0974 216.7047 231.1249 236.7939 246.8576 252.1623 281.8883 297.0648 314.0908 323.8284 367.9739 396.7336 405.6509 430.5142 459.0501 482.0680 487.5696 526.1846 632.3864 708.5592 741.0560 765.5128 797.1714 805.7159 815.2886 829.7289 834.3719 844.4837 892.0773 895.8258 918.1810 931.5876 934.2948 936.1180 944.7880 960.5111 999.9410 1006.8771 1025.0850 1026.6161 1048.7090 1062.7573 1077.9330 1079.3711 1083.6181 1095.8600 1099.7224 1103.4013 1106.7839 1119.6205 1131.1999 1135.4205 1148.1970 1156.8171 1172.9223 1181.5455 1210.6905 1211.5269 1220.2980 1251.7635 1253.2541 1255.4641 1268.9470 1269.4413 1271.1882 1282.7262 1306.4666 1310.5846 1330.8930 1335.6847 1340.1147 1343.7604 1353.2744 1357.4930 1366.9935 1376.0962 1387.2120 1391.9118 1392.4992 1393.6419 1418.0583 1450.1668 1455.6695 1461.3854 1463.7784 1467.8232 1469.0490 1471.2545 1472.6244 1476.9703 1477.2218 1478.8253 1481.3608 1483.8131 1486.0670 1489.8059 1493.9714 1496.8865 1644.3654 2907.5418 2923.0708 2940.0815 2946.4039 2955.1923 2958.5653 2961.5295 2966.1590 2966.3989 2974.8557 2974.9026 2976.3335 2979.5180 2983.0656 2984.3072 2990.8657 3009.6500 3014.0658 3019.0315 3023.3789 3030.3953 3047.3423 3051.3610 3053.9418 3059.9552 3063.4868 3073.3183 3074.2860 3074.4764 3075.8192 3076.3782 3094.8610
redmass: 3.6575 3.4358 1.8048 4.5388 4.1248 2.8041 4.2662 2.5259 2.1734 2.8412 3.2125 2.6462 2.3654 3.0787 3.7477 3.0767 2.5400 2.7242 2.2644 1.1285 1.8823 1.1265 3.4782 1.5756 1.4676 2.6558 2.6332 3.6091 3.3676 2.9916 2.1532 2.6192 3.0929 3.5574 3.1629 2.9927 2.9423 2.8573 4.2891 1.0730 2.3429 1.7537 1.1284 2.5946 1.5663 1.6983 2.8635 2.1235 1.5567 1.1914 2.0328 2.9189 1.1660 1.8183 1.6067 2.7753 3.2500 3.8633 2.3325 1.9135 4.0556 4.4906 2.6750 2.3883 2.1717 2.7189 2.2682 1.7254 2.1933 2.0151 2.4277 1.4217 2.4820 1.1924 1.8811 1.3400 1.1600 1.4405 1.1813 1.1961 1.1457 1.1910 1.2832 1.1656 1.0824 1.2614 1.2161 1.4215 1.3964 1.3128 1.4090 1.3971 1.4478 1.4904 1.2278 1.3211 1.3289 1.2111 1.2238 1.5468 1.0855 1.0893 1.0872 1.0744 1.0550 1.0740 1.0566 1.0681 1.0483 1.0426 1.0667 1.0620 1.0515 1.0732 1.0839 1.0646 1.0662 8.8933 1.0547 1.0572 1.0560 1.0539 1.1057 1.0580 1.0389 1.0436 1.0587 1.0664 1.0439 1.0358 1.1020 1.1043 1.0605 1.0592 1.1005 1.1100 1.0938 1.0589 1.0977 1.0951 1.0992 1.1039 1.0984 1.0995 1.1011 1.0993 1.0994 1.1004 1.0984 1.1070
irintensity: 0.0250 0.0486 0.9706 0.7016 0.5144 0.2278 0.1176 0.1259 0.4761 0.0354 0.8617 3.3411 2.7749 1.1288 1.3620 9.2774 8.7674 3.4694 0.5033 0.3730 0.3419 0.1135 0.7529 1.7250 0.6831 1.0558 0.5756 3.8788 11.5579 5.8685 0.1988 0.8751 1.7002 8.5617 1.6586 2.2384 3.8209 0.9199 3.3679 8.9324 13.1886 3.4897 0.3382 2.1325 6.6433 10.6358 10.0270 8.2045 5.8289 3.5923 31.0973 3.9741 0.4580 3.2099 0.5591 15.3187 40.8512 9.4560 42.9219 0.6801 24.2095 259.1121 75.0713 13.6025 128.5109 40.8527 17.6551 14.0433 3.9136 31.1410 34.4210 0.8237 10.5876 11.1565 10.0486 0.2422 5.5518 5.9874 4.6612 8.7595 0.0460 4.0060 0.2019 0.1467 0.0756 2.1228 23.8273 2.2461 5.9019 6.3000 1.1212 1.7633 3.2090 21.7663 16.5460 20.0514 5.7406 24.0356 8.5345 0.9612 2.8234 16.6154 14.4978 5.4930 8.4224 1.7471 7.5071 2.3839 11.2341 12.5874 3.6703 12.1431 12.8608 10.9957 1.6493 22.1028 7.7353 134.2539 49.0884 59.4167 17.9477 118.6188 52.0891 17.1769 40.7391 22.5836 37.8821 15.3792 34.5060 34.8611 35.3309 10.4284 37.7499 44.4272 6.0811 113.8530 8.4997 48.1527 3.9812 12.4410 0.8144 27.3824 106.7748 40.5861 94.6634 58.8934 55.5270 68.8792 32.4444 13.2273
temp: 298.150 k
press: 1.00000 atm
elementType: 8 8 8 8 6 6 6 6 6 6 6 6 6 6 6 6 6 6 6 6 1 1 1 1 1 1 1 1 1 1 1 1 1 1 1 1 1 1 1 1 1 1 1 1 1 1 1 1 1 1 1 1
symmnumber: 1
zpe: 1200382.8 jmol-1
zpe.correction: 0.457202 hartree
zpe.thermalcorrener: 0.483692 hartree
zpe.thermalcorrenthalpy: 0.484636 hartree
zpe.thermalcorrgfe: 0.394673 hartree
zpe.sumelectzpe: -928.105057 hartree
zpe.sumelectthermal: -928.078567 hartree
zpe.sumelectthermalent: -928.077623 hartree
zpe.sumelectthermalfe: -928.167586 hartree
dipole: -1.1288 0.2111 1.4713
dipole: 1.8664
quadrupole: -122.1012 -115.0412 -131.1269
quadrupole: 1.9473 10.5015 2.2350
quadrupole: 0.6552 7.7152 -8.3704 1.9473 10.5015 2.2350
hfenergy: -928.5622591 hartree
pointgroup: C01 [X(C16H32O4)]
dipole: 0.4869625 -0.0167736 -0.5493493 debye
polarizability: 227.8996563|-9.8218283|185.2521925|0.97549|-6.8527435|157.6704497 unknown
InChI: InChI=1S/C16H32O4/c1-5-7-8-18-9-10-19-11-12-20-16(17)15(6-2)13-14(3)4/h14-15H,5-13H2,1-4H3
charge 0 multiplicity 1
52 atoms
O  -2.633298 1.568009 -0.813106
O  -3.360921 1.130724 1.366107
O  0.230451 1.803724 -0.0254
O  3.604798 0.361926 -0.031236
C  -3.787391 -0.518912 -0.426862
C  -2.92165 -1.701336 0.106617
C  -1.406377 -1.63688 -0.224452
C  -5.281459 -0.715239 -0.051481
C  -0.672604 -2.807026 0.473663
C  -1.138147 -1.656365 -1.748513
C  -3.2657 0.783978 0.167238
C  -6.217174 0.356139 -0.649988
C  -1.941466 2.805686 -0.36306
C  -0.50162 2.762127 -0.853114
C  5.765087 -0.710991 0.223604
C  4.348019 -0.600882 0.79302
C  6.647704 -1.700266 1.019692
C  1.600681 1.583411 -0.502784
C  2.232724 0.561988 0.44111
C  8.07843 -1.805166 0.448775
H  -3.690681 -0.453837 -1.525716
H  -3.050422 -1.748368 1.206761
H  -3.342149 -2.640575 -0.309823
H  -0.999199 -0.686239 0.178087
H  -5.369534 -0.715399 1.052116
H  -5.591533 -1.719529 -0.401983
H  -0.827993 -2.782649 1.568612
H  0.416757 -2.764645 0.28294
H  -1.039851 -3.78303 0.099823
H  -1.56724 -0.770105 -2.2487
H  -0.050723 -1.659801 -1.953229
H  -1.57089 -2.563738 -2.214581
H  -7.269855 0.155821 -0.379311
H  -6.148904 0.377864 -1.75391
H  -5.963008 1.364216 -0.2737
H  -1.990546 2.868232 0.738071
H  -2.481322 3.655325 -0.817038
H  -0.051264 3.776912 -0.761855
H  -0.470056 2.459675 -1.922476
H  6.228395 0.294682 0.226512
H  5.700312 -1.029989 -0.83474
H  4.373935 -0.25156 1.850639
H  3.835375 -1.590057 0.77253
H  6.696508 -1.380717 2.080792
H  6.17424 -2.703352 1.016866
H  2.182769 2.529514 -0.482736
H  1.59582 1.193804 -1.542975
H  2.223425 0.946724 1.483434
H  1.660772 -0.390776 0.415122
H  8.585751 -0.822396 0.470042
H  8.69373 -2.516664 1.029299
H  8.061199 -2.150695 -0.60191
