program: Gaussian 09
title: 000021213
version: EM64L-G09RevD.01
frameworkgroup: C1[X(C8H13N5O)]
method: RPBEPBE
basis: SDD
operation: Freq
keyword: #p
keyword: freq=noraman
keyword: PBEPBE/SDD
title: #p freq=noraman PBEPBE/SDD
converged: YES YES NO NO
title: Mulliken charges:
elementType: O N N N N N C C C C C C C C H H H H H H H H H H H H H
charge: -0.254422 -0.273806 -0.218544 -0.658089 -0.631725 -0.645345 0.347590 -0.561400 0.330607 -0.405698 -0.388822 -0.788803 0.244626 0.245708 0.217705 0.211507 0.253558 0.250754 0.232800 0.239485 0.239198 0.329713 0.325602 0.303029 0.332900 0.440408 0.281464
chargesum: 0.00000
title: Mulliken charges with hydrogens summed into heavy atoms:
elementType: O N N N N N C C C C C C C C
charge: -0.254422 -0.273806 -0.218544 -0.002775 0.004204 0.076527 0.347590 -0.132187 0.330607 -0.152140 -0.138068 -0.077319 0.244626 0.245708
polarizability: 1.68782794e+02 -2.36644766e+00 1.33538942e+02 7.64466872e+00 -3.67049022e-01 9.08088198e+01
1716.lowfreq: -9.9397 -5.3612 -3.0790 0.0002 0.0004 0.0006 18.8646 26.5892 50.9304
frequency: 17.4921 26.4834 50.9102 97.8850 116.3715 121.5879 148.9454 200.5887 216.5921 246.6448 255.8982 272.2926 321.7270 335.1024 371.9945 399.8207 442.7517 458.5511 506.2260 513.6961 521.8659 605.4608 612.5382 647.5961 676.9609 682.0871 712.2506 753.1649 798.7946 849.0292 861.1397 881.8032 933.0037 959.9982 962.4355 990.3823 1004.1430 1007.6065 1026.4584 1046.8450 1078.7247 1108.1615 1161.6390 1169.7018 1204.6419 1219.0926 1251.0415 1334.2134 1344.5619 1395.7242 1402.8608 1421.6417 1448.0014 1455.4954 1472.9101 1508.0815 1553.2689 1576.6944 1599.2437 1603.2491 1611.2320 1654.8465 2727.8853 2882.5122 2932.9776 2979.7468 3055.0850 3099.5227 3214.0253 3233.0146 3563.1575 3564.5347 3593.7893 3719.5165 3720.9486
redmass: 3.9261 4.2207 4.4527 4.2926 1.1148 3.3691 5.0926 1.7563 2.7823 2.2213 3.6967 1.8804 3.9389 1.3550 2.5853 3.0413 1.2047 4.7298 2.7284 1.1066 1.1485 4.5634 3.5603 4.6488 4.5078 8.5633 8.7554 4.3635 1.2368 1.6734 2.5997 3.2077 4.4262 3.6642 2.7960 1.8305 1.0817 1.8075 1.2591 1.4568 1.7234 3.4258 1.7006 1.8002 3.1109 1.8157 1.8658 1.4242 2.5795 3.5165 1.2491 1.8575 1.1225 1.0440 1.0919 3.3167 3.4723 7.3550 1.2984 1.5691 6.2160 2.2286 1.0819 1.0584 1.0979 1.0375 1.0982 1.0976 1.0938 1.1040 1.0442 1.0450 1.0819 1.1045 1.1052
irintensity: 0.2081 0.1385 0.3986 0.1377 0.3780 5.1126 15.7830 18.3568 14.5652 62.9024 4.3439 47.1582 6.0069 114.5217 2.0296 8.7955 402.4731 1.4431 4.5688 112.5898 10.8914 6.8971 0.2150 0.6413 2.3349 0.0281 11.6416 15.4446 82.3888 2.5631 3.5181 8.2457 3.9997 5.9517 0.7300 8.9021 107.9425 16.1686 34.2002 5.8725 2.9656 58.6291 17.4332 1.2563 7.1719 9.1499 4.1657 151.8821 3.2346 171.7982 9.0336 133.3613 15.8148 15.5663 13.4466 87.1465 295.3343 34.1647 201.5446 418.8814 5.2004 892.3163 623.2576 58.0680 40.1316 37.3650 18.9312 15.9290 9.1935 1.3886 40.1944 71.0179 15.9799 24.9842 32.9335
temp: 298.150 k
press: 1.00000 atm
elementType: 8 7 7 7 7 7 6 6 6 6 6 6 6 6 1 1 1 1 1 1 1 1 1 1 1 1 1
symmnumber: 1
zpe: 565336.4 jmol-1
zpe.correction: 0.215325 hartree
zpe.thermalcorrener: 0.230350 hartree
zpe.thermalcorrenthalpy: 0.231294 hartree
zpe.thermalcorrgfe: 0.171472 hartree
zpe.sumelectzpe: -660.573399 hartree
zpe.sumelectthermal: -660.558375 hartree
zpe.sumelectthermalent: -660.557431 hartree
zpe.sumelectthermalfe: -660.617252 hartree
dipole: -0.7047 -1.2232 0.4081
dipole: 1.4695
quadrupole: -66.9858 -62.5262 -84.7642
quadrupole: 4.1070 0.3009 -3.1606
quadrupole: 4.4396 8.8992 -13.3388 4.1070 0.3009 -3.1606
hfenergy: -660.7887242 hartree
pointgroup: C01 [X(C8H13N5O1)]
dipole: 0.302469 0.433946 0.2333135 debye
polarizability: 168.4044812|-2.8845369|132.5062369|-8.357886|7.6175347|92.2198376 unknown
InChI: InChI=1S/C8H13N5O/c1-5-2-3-6(14-5)4-12-8(11)13-7(9)10/h2-3H,4,9-11H2,1H3
charge 0 multiplicity 1
27 atoms
O  -2.067379 0.38267 -0.828136
N  0.852908 -0.527487 -0.194763
N  3.243326 -0.291245 -0.418425
N  2.251065 -2.23724 -1.175458
N  4.462834 1.572013 0.243024
N  2.102996 1.572421 0.567941
C  -1.602702 -0.669925 -0.002364
C  -0.344279 -1.363148 -0.424924
C  -3.257378 0.879102 -0.246518
C  -2.479171 -0.829536 1.05751
C  -3.532196 0.156608 0.904133
C  -3.928953 2.008415 -0.958709
C  2.04831 -0.994065 -0.576791
C  3.234472 0.937846 0.130045
H  -0.29394 -2.316826 0.149434
H  -0.439792 -1.639704 -1.502496
H  -2.379984 -1.558116 1.860032
H  -4.384747 0.3097 1.563217
H  -4.834671 2.311313 -0.407757
H  -3.264161 2.888285 -1.042155
H  -4.228209 1.722204 -1.984377
H  1.488697 -2.877873 -1.369254
H  3.204771 -2.480854 -1.42947
H  4.567234 2.492503 0.65789
H  5.275868 1.064194 -0.094275
H  1.232659 0.96296 0.412527
H  2.113722 2.510786 0.962816
