program: Gaussian 09
title: 000237190
version: EM64L-G09RevD.01
frameworkgroup: C1[X(C10H9Cl2NO2)]
method: RPBEPBE
basis: SDD
operation: Freq
keyword: #p
keyword: freq=noraman
keyword: PBEPBE/SDD
title: #p freq=noraman PBEPBE/SDD
converged: YES YES NO NO
title: Mulliken charges:
elementType: Cl Cl O O N C C C C C C C C C C H H H H H H H H H
charge: -0.011957 -0.035298 -0.237818 -0.246434 -0.190470 -0.357906 -0.536358 -0.304855 0.615261 0.285087 -0.314305 -0.389261 -0.200246 -0.222781 -0.104710 0.245310 0.232763 0.281151 0.233031 0.232602 0.235835 0.244161 0.284563 0.262636
chargesum: 0.00000
title: Mulliken charges with hydrogens summed into heavy atoms:
elementType: Cl Cl O O N C C C C C C C C C C
charge: -0.011957 -0.035298 -0.237818 -0.246434 -0.190470 0.120167 -0.022177 0.163582 0.615261 0.285087 -0.314305 -0.145100 0.084317 0.039854 -0.104710
polarizability: 1.84409572e+02 -1.77168916e+01 1.24572319e+02 1.00085575e+01 8.71447840e+00 9.61943283e+01
1716.lowfreq: -7.0418 -3.5068 -0.0032 -0.0019 -0.0018 7.2964 27.1836 39.9749 43.1560
frequency: 27.0179 39.9319 43.1393 107.6954 135.9642 164.0446 171.3841 183.0606 192.8937 225.7873 290.4554 309.9133 370.8440 403.1886 433.2925 443.4036 512.9046 548.4369 626.2257 645.0326 661.2155 681.3014 694.4983 723.5001 774.0697 813.5627 841.7843 854.0465 868.2617 927.2338 949.7460 959.1511 999.4041 1000.7392 1030.5725 1085.9792 1104.7082 1137.0609 1162.4942 1178.8965 1197.1032 1210.4414 1251.5202 1256.8974 1287.2954 1336.0701 1357.4157 1373.9058 1379.1672 1393.5689 1455.0566 1470.4856 1481.5456 1498.7253 1571.0753 1592.0658 1714.3744 2956.0301 2960.1422 3027.2529 3044.0206 3049.9886 3117.1218 3133.3135 3177.8255 3182.5172
redmass: 7.7524 6.3903 8.9206 4.2776 2.6176 6.3125 5.4045 13.9077 8.2543 6.2262 2.6886 6.6797 9.9778 6.1664 3.5579 3.4169 7.3022 5.4582 4.0179 5.7841 5.7200 9.5343 6.3979 5.0044 3.6522 2.3531 2.3039 1.6702 1.4043 2.2370 2.2210 1.6292 2.7953 5.1130 3.7561 2.7444 1.5754 1.5688 1.6866 1.1699 1.4295 2.0413 1.8173 1.8786 1.6296 1.3709 1.7686 4.1600 2.3011 2.0614 1.9561 1.2707 1.0921 1.0903 7.6476 7.3806 11.7233 1.0670 1.0660 1.0664 1.0952 1.0924 1.1066 1.0902 1.0952 1.0938
irintensity: 2.8118 5.9316 1.8167 2.6292 0.3759 0.8270 2.6300 2.2604 1.5748 8.1214 3.2624 2.9001 5.1563 15.0045 5.5448 6.6402 4.1004 2.4905 26.1013 0.4363 4.4485 13.9524 16.8955 9.0259 20.5237 45.0217 54.5364 3.1385 17.3204 43.5859 9.3379 4.5735 33.6323 125.9244 27.1201 27.7360 3.4295 55.8632 81.4368 2.8905 20.7128 3.8892 40.2019 98.7382 8.6758 5.8433 14.2534 7.5868 33.8390 33.7177 79.7297 25.9575 6.9685 6.1345 27.3172 54.3991 463.9597 36.0292 62.7824 29.0157 7.1839 33.6532 25.1675 7.7530 1.2789 1.2587
temp: 298.150 k
press: 1.00000 atm
elementType: 17 17 8 8 7 6 6 6 6 6 6 6 6 6 6 1 1 1 1 1 1 1 1 1
symmnumber: 1
zpe: 453371.3 jmol-1
zpe.correction: 0.172680 hartree
zpe.thermalcorrener: 0.186438 hartree
zpe.thermalcorrenthalpy: 0.187382 hartree
zpe.thermalcorrgfe: 0.129742 hartree
zpe.sumelectzpe: -1510.691092 hartree
zpe.sumelectthermal: -1510.677334 hartree
zpe.sumelectthermalent: -1510.676390 hartree
zpe.sumelectthermalfe: -1510.734030 hartree
dipole: 3.0223 -5.2951 0.9979
dipole: 6.1780
quadrupole: -126.4438 -94.9831 -96.8091
quadrupole: 12.4808 -7.5781 3.3115
quadrupole: -20.3652 11.0956 9.2695 12.4808 -7.5781 3.3115
hfenergy: -1510.8637721 hartree
pointgroup: C01 [X(C10H9Cl2N1O2)]
dipole: 1.0824066 -2.1742845 -0.0938203 debye
dipolederiv: -0.3096009 0.2460327 0.0943001 0.2817948 -0.395042 -0.1717525 0.1254853 -0.1936368 -0.1469053 -0.7831207 0.0961769 -0.2246107 0.0860039 -0.1044115 -0.006438 -0.2860277 0.0036263 -0.1752852 -0.7186697 -0.1871659 0.2695935 -0.1904921 -0.6945612 0.392695 0.3750955 0.3694208 -0.6925912 -0.6704909 0.1753846 -0.0036642 0.3556084 -0.9942772 0.3240389 -0.0616279 0.3579838 -0.5530827 -1.3380401 0.2562675 0.1057682 0.2548215 -0.645261 0.0450211 0.1132447 0.1236974 -0.4434403 0.0386248 0.0798472 0.1326499 0.1304577 0.4836151 0.0352923 0.2294727 -0.0410491 0.2047171 0.7389801 0.1177427 -0.0745038 0.2958825 0.110633 0.0778642 -0.1878104 0.0600078 0.4428118 0.21896 -0.0766232 0.1637402 0.103511 0.4528398 -0.1801775 -0.0104323 -0.0891696 0.3958019 -0.0332224 0.0699568 0.0838434 0.0352367 -0.1914755 -0.12395 0.0553449 -0.1143216 -0.1674101 1.6830295 -0.2806788 -0.4118018 -0.7133814 1.4560647 -0.5702807 -0.3625591 -0.6185872 0.8653832 0.4500168 -0.4493292 -0.1436072 -0.3815366 0.5694173 0.3588931 -0.1142274 0.3458518 0.1668553 0.0523612 -0.0814534 0.0458317 -0.1011673 -0.0018117 0.0911085 0.032142 0.0923203 -0.0255066 -0.4504027 0.1835425 -0.0186273 0.1647434 -0.1771683 -0.0299264 -0.0556114 -0.0182722 -0.0907049 -0.3260629 -0.0369941 -0.1228015 -0.0507515 -0.0582771 0.0198644 -0.1612706 0.0307262 -0.1429569 1.1406973 -0.1736814 0.4001474 -0.1644642 0.1169953 0.0845036 0.4538716 0.0801042 0.2099588 -0.0358597 0.0928692 -0.0963245 0.0566406 0.0189035 0.0131462 -0.1102778 0.0205496 0.0288468 0.061054 -0.0363215 -0.0081134 -0.0195079 -0.1308581 -0.0594145 -0.0299566 -0.1422692 -0.0617582 0.0641225 0.0201065 -0.036346 -0.0617032 0.0166512 0.0575889 0.0385174 -0.0020549 0.1009466 -0.039359 -0.0094767 0.0408255 -0.0241632 0.0077576 -0.172217 0.0723468 -0.0682957 -0.0971285 -0.0044539 -0.087226 0.0129868 -0.1089992 -0.068502 0.0662679 0.0048475 0.0147158 0.0750203 0.059685 0.0356394 -0.109589 -0.004331 0.0189539 -0.0366113 -0.026357 0.010401 -0.1307534 0.0636161 -0.0281122 -0.0818311 -0.0171433 0.0476335 -0.0905169 -0.0617705 -0.0992775 0.0260442 0.0940426 -0.0005424 -0.0321804 -0.0059902 0.096724 -0.0643355 -0.0366762 -0.0635666 0.0917731 0.0440931 0.0740387 0.0143145 0.0789305 0.0654566 -0.0606637 0.0042363 -0.0589046 0.119364 unknown
polarizability: 181.2161434|-23.849691|120.651939|10.3716493|12.9806593|103.3081373 unknown
InChI: InChI=1S/C10H9Cl2NO2/c11-8-2-1-7(9(12)5-8)6-13-3-4-15-10(13)14/h1-2,5H,3-4,6H2
charge 0 multiplicity 1
24 atoms
Cl 0.096799 2.137574 0.885894
Cl 4.971345 -0.483277 0.941908
O  -3.806898 -0.182586 0.625983
O  -3.203315 1.577435 -0.817271
N  -1.785108 -0.288898 -0.428543
C  -1.894536 -1.603335 0.219688
C  -0.727927 0.075744 -1.37679
C  -3.081186 -1.355678 1.191141
C  0.671407 -0.044796 -0.787439
C  -2.932868 0.490116 -0.276338
C  1.1567 0.810275 0.232738
C  1.560015 -1.041714 -1.26507
C  2.453549 0.694358 0.77081
C  2.868437 -1.191474 -0.755415
C  3.292365 -0.316228 0.261981
H  -0.969847 -1.873216 0.758818
H  -2.11567 -2.398634 -0.522553
H  -0.945992 1.115837 -1.683644
H  -0.788636 -0.562654 -2.282621
H  -3.790868 -2.194421 1.241554
H  -2.735222 -1.084214 2.203534
H  1.21771 -1.714367 -2.06031
H  2.798019 1.374259 1.553661
H  3.538026 -1.965206 -1.140012
