program: Gaussian 09
title: 000237187
version: EM64L-G09RevD.01
frameworkgroup: C1[X(C10H9Cl2NO2)]
method: RPBEPBE
basis: SDD
operation: Freq
keyword: #p
keyword: freq=noraman
keyword: PBEPBE/SDD
title: #p freq=noraman PBEPBE/SDD
converged: YES YES NO NO
title: Mulliken charges:
elementType: Cl Cl O O N C C C C C C C C C C H H H H H H H H H
charge: -0.012312 -0.001038 -0.236606 -0.258426 -0.184467 -0.358349 -0.571360 -0.302000 0.519600 0.285353 -0.408513 -0.362830 -0.059627 -0.200490 -0.107626 0.236284 0.245152 0.232457 0.268775 0.236414 0.235551 0.260830 0.280320 0.262906
chargesum: 0.00000
title: Mulliken charges with hydrogens summed into heavy atoms:
elementType: Cl Cl O O N C C C C C C C C C C
charge: -0.012312 -0.001038 -0.236606 -0.258426 -0.184467 0.123088 -0.070128 0.169965 0.519600 0.285353 -0.147683 -0.082510 -0.059627 0.062416 -0.107626
polarizability: 1.79870686e+02 7.00235927e+00 1.34778693e+02 1.26019917e+01 -1.01899252e+00 8.90496387e+01
1716.lowfreq: -4.2914 -0.0026 -0.0010 0.0006 1.8473 8.8430 17.2164 35.4221 41.8290
frequency: 17.1533 35.4112 41.8021 99.2076 130.3119 162.7221 168.8424 181.5534 186.8064 249.6482 301.8590 309.3155 363.7347 433.3816 435.6597 445.8578 496.0940 553.4907 629.9309 654.2549 663.5734 673.9025 684.9733 723.7994 757.4565 834.5026 848.3844 855.2985 885.4876 925.1238 948.3437 973.6980 999.4629 1001.9467 1015.8889 1103.2789 1118.8078 1145.1239 1156.4477 1181.6273 1195.6683 1204.4810 1245.6216 1257.9713 1292.0640 1337.3259 1355.8729 1369.5285 1384.1564 1398.8441 1453.3049 1464.4218 1482.7691 1498.9283 1571.1877 1595.5581 1703.3313 2973.6790 3003.5507 3028.3743 3047.3694 3065.4402 3118.7344 3144.0774 3145.8516 3172.1440
redmass: 7.5287 5.4994 8.5171 5.5563 2.2891 8.0931 6.0794 5.7826 14.7501 6.8462 3.6098 6.3732 4.1077 4.2022 4.6772 4.2679 6.2575 6.0112 5.3375 6.2520 5.4219 6.7388 8.3656 4.0122 3.6885 1.7010 2.8715 1.6764 1.5534 2.3831 2.7894 1.3735 3.5147 5.8522 3.6145 1.5675 2.1234 1.7809 1.7105 1.1801 1.2482 2.3134 2.1960 1.7906 1.6944 1.3187 1.3676 5.3222 2.6298 1.9798 1.4640 1.6503 1.0920 1.0904 7.5607 6.4439 11.3145 1.0632 1.0603 1.0697 1.0935 1.1029 1.1069 1.0916 1.0913 1.0961
irintensity: 4.9031 8.1048 1.9523 0.5214 0.2698 1.7052 4.2912 2.2428 0.9830 3.3560 5.1288 1.0851 3.5074 2.9792 18.4364 12.5052 2.0407 4.0461 6.3213 26.9325 3.6860 5.8191 18.5089 15.2731 25.0444 21.6758 26.4969 7.2422 2.7394 60.7618 8.0243 2.4647 43.2017 31.0105 125.5421 1.8565 29.7859 40.7727 52.6560 22.2387 22.3543 9.0988 128.9089 42.9728 8.6132 6.5699 8.7628 20.3466 55.8138 16.8649 50.1755 37.4832 8.1378 6.5941 16.3387 3.6155 413.8006 39.7312 31.1592 28.7215 48.5289 4.0520 20.7397 1.1706 0.7945 0.9019
temp: 298.150 k
press: 1.00000 atm
elementType: 17 17 8 8 7 6 6 6 6 6 6 6 6 6 6 1 1 1 1 1 1 1 1 1
symmnumber: 1
zpe: 454009.3 jmol-1
zpe.correction: 0.172923 hartree
zpe.thermalcorrener: 0.186687 hartree
zpe.thermalcorrenthalpy: 0.187631 hartree
zpe.thermalcorrgfe: 0.129290 hartree
zpe.sumelectzpe: -1510.689989 hartree
zpe.sumelectthermal: -1510.676225 hartree
zpe.sumelectthermalent: -1510.675281 hartree
zpe.sumelectthermalfe: -1510.733623 hartree
dipole: -0.5543 4.2622 1.0030
dipole: 4.4136
quadrupole: -121.6235 -97.8234 -98.7087
quadrupole: -20.0096 -6.3478 -0.9698
quadrupole: -15.5716 8.2285 7.3431 -20.0096 -6.3478 -0.9698
hfenergy: -1510.8629122 hartree
pointgroup: C01 [X(C10H9Cl2N1O2)]
dipole: -0.3220296 1.7014959 -0.1282546 debye
dipolederiv: -0.4083214 -0.311829 0.0449282 -0.3813362 -0.4075028 0.0716166 0.0428409 0.0675366 -0.0559983 -0.6117302 0.1042052 -0.2728732 0.103836 -0.0743522 0.0642466 -0.3160559 0.0713013 -0.1849162 -0.7575502 0.2072407 0.3053515 0.2435039 -0.6839503 -0.2586278 0.5419054 -0.3409619 -0.6578518 -0.5994627 -0.0241291 0.0833593 -0.1965162 -1.1512211 -0.2235658 0.0756268 -0.280333 -0.4803915 -1.0542923 -0.1569613 0.0955667 -0.3677795 -0.8167401 0.0796286 0.3163056 0.0776275 -0.5199754 0.0540689 -0.0874827 0.1737607 -0.0921627 0.3982427 0.0527585 0.1906731 0.1237404 0.2560494 0.7683476 -0.0605512 -0.0692483 -0.1861887 0.128328 -0.0865796 -0.1918396 -0.0996805 0.3973053 0.2901349 -0.0206014 0.0783548 -0.2594599 0.526719 0.1391139 0.0224962 0.0278116 0.2985001 0.0797661 0.0065366 0.0894029 0.0415922 0.0119121 -0.0113036 0.063113 -0.014818 -0.1106649 1.326344 0.1278444 -0.5458496 0.5982357 1.7342916 0.2565041 -0.7641196 0.4022528 0.8466251 -0.2275259 -0.1250969 0.0448708 -0.0388007 -0.126463 -0.0148489 -0.0121563 -0.0494849 -0.0676028 -0.0891544 0.0504177 0.0096059 0.0438496 -0.0406225 -0.0544035 -0.0144902 -0.0327928 -0.1047904 0.4042823 0.5999185 -0.166037 0.5787899 0.5645727 -0.119328 -0.1377239 -0.0672527 -0.0338399 -0.193903 0.0600583 -0.0783438 -0.0070018 0.0209575 -0.0514884 -0.0402194 -0.0306939 -0.0875388 0.7564703 -0.2922925 0.498371 -0.2096024 -0.0687994 -0.0665342 0.4763449 -0.1233198 0.1952555 0.0941813 -0.0183029 -0.0063283 0.0002687 -0.1111912 0.0515561 -0.0172413 0.1142328 0.0105573 -0.0521965 -0.0577069 -0.1130894 -0.0170334 0.0062477 -0.0068762 -0.1234465 -0.0661892 -0.0328319 -0.0231636 -0.0106954 0.0486293 0.0179706 -0.0383479 0.1680814 0.0310324 0.0723283 0.0005251 -0.0058741 -0.0090548 -0.0481788 0.0362347 0.0234531 -0.1057782 0.0072157 -0.0184801 0.0743669 0.0851433 -0.0071998 -0.0184111 0.031102 0.0286626 -0.0573836 0.0432693 -0.0774525 -0.0966323 -0.083822 0.0740201 -0.0465569 0.1032066 -0.0420537 -0.0079231 -0.1022411 0.067377 0.042685 0.0953376 0.0316496 -0.0527389 0.0197209 0.0215608 0.0771277 -0.0383698 0.0810314 0.0862728 0.0746763 -0.0864518 -0.0200451 -0.0748873 0.0720572 0.0286707 -0.0138293 0.0187311 0.1217772 0.0782438 0.0064644 -0.0345008 0.0124579 0.0242393 0.0753367 -0.0390903 0.0774882 0.1031145 unknown
polarizability: 177.4642747|13.9169516|131.7555395|13.8635903|-12.5536625|94.4792035 unknown
InChI: InChI=1S/C10H9Cl2NO2/c11-8-2-1-7(5-9(8)12)6-13-3-4-15-10(13)14/h1-2,5H,3-4,6H2
charge 0 multiplicity 1
24 atoms
Cl 3.899232 2.035574 -0.516681
Cl 4.489957 -0.683606 1.248087
O  -3.713078 -0.294069 0.853982
O  -2.831507 -1.947217 -0.572024
N  -2.056009 0.297834 -0.600741
C  -2.19395 1.489277 0.252387
C  -0.954288 0.099507 -1.553758
C  -3.535333 1.182486 0.975134
C  0.402343 -0.085826 -0.874529
C  -2.847439 -0.766986 -0.170063
C  1.405668 0.903807 -0.984934
C  0.665804 -1.254638 -0.113065
C  2.651342 0.733453 -0.343646
C  1.909231 -1.424024 0.527188
C  2.905305 -0.428853 0.413106
H  -2.251878 2.415005 -0.347591
H  -1.34478 1.578585 0.958906
H  -0.923078 0.96048 -2.246955
H  -1.214406 -0.801468 -2.138542
H  -3.523776 1.428625 2.046978
H  -4.393753 1.667809 0.479629
H  1.231035 1.811603 -1.572747
H  -0.101792 -2.031782 -0.027649
H  2.119753 -2.324575 1.111332
