program: Gaussian 09
title: 000021297
version: EM64L-G09RevD.01
frameworkgroup: C1[X(C20H28N2O)]
method: RPBEPBE
basis: SDD
operation: Freq
keyword: #p
keyword: freq=noraman
keyword: PBEPBE/SDD
title: #p freq=noraman PBEPBE/SDD
converged: YES YES NO NO
title: Mulliken charges:
elementType: O N N C C C C C C C C C C C C C C C C C C C C H H H H H H H H H H H H H H H H H H H H H H H H H H H H
charge: -0.294973 -0.032337 -0.103985 -0.389762 -0.564112 -0.386956 0.230108 -0.393805 -0.500756 -0.039711 0.138493 0.253479 -0.087350 -0.293187 -0.392697 -0.358532 -0.330787 -0.326117 -0.326993 -0.257888 -0.229161 -0.670069 -0.670026 0.202441 0.199694 0.208729 0.239976 0.186778 0.203894 0.212690 0.205632 0.239072 0.197273 0.229396 0.213064 0.215593 0.218426 0.252730 0.205794 0.190961 0.205650 0.193169 0.261997 0.225915 0.228785 0.228365 0.209346 0.208172 0.226804 0.209136 0.207642
chargesum: 0.00000
title: Mulliken charges with hydrogens summed into heavy atoms:
elementType: O N N C C C C C C C C C C C C C C C C C C C C
charge: -0.294973 -0.032337 -0.103985 0.012373 -0.115407 0.003717 0.230108 0.024516 -0.064411 -0.039711 0.138493 0.253479 -0.087350 0.149272 0.041323 -0.105802 -0.068790 0.070638 0.071826 -0.031973 -0.000376 -0.024186 -0.026444
polarizability: 2.63595918e+02 -8.61275393e-01 3.09163778e+02 -1.69761523e+01 1.17805282e+01 1.53966027e+02
1716.lowfreq: -10.0098 -0.0006 -0.0005 0.0004 6.1995 6.9964 10.7929 13.8792 35.7326
frequency: 7.9702 13.5258 35.5824 49.7590 62.5720 75.9693 81.4955 87.1268 110.2029 141.7617 153.5282 165.5709 182.5230 195.9144 215.5988 241.0179 257.6976 269.0671 280.5469 295.6267 323.0196 326.8152 336.1408 368.3107 373.2451 411.9502 435.8685 448.6735 454.0571 467.7037 475.8568 516.7522 545.4730 570.2848 574.9266 632.3153 656.2083 673.5252 728.3907 743.8708 760.3796 779.1820 791.0488 795.9882 803.2266 804.6781 826.8726 832.1016 855.7355 865.3991 886.2611 897.0578 915.1496 927.6640 954.1716 958.8006 968.7642 989.4189 994.8825 1015.9786 1030.7788 1045.2441 1062.5436 1063.0201 1069.3965 1076.2718 1084.6009 1092.2112 1097.8140 1116.6558 1121.7527 1132.6681 1148.2541 1157.8224 1166.3452 1203.4895 1204.9070 1208.9028 1232.7089 1234.0283 1252.3642 1267.0842 1272.9650 1276.6238 1289.3626 1293.3883 1309.5703 1318.5817 1329.3289 1331.1258 1340.3670 1346.8834 1352.3165 1362.6638 1367.0455 1370.5601 1385.7266 1387.3273 1389.6422 1394.8582 1420.3071 1446.1812 1458.6481 1460.0030 1460.8806 1463.0053 1463.4199 1469.0324 1469.8147 1472.9958 1477.6872 1480.6395 1484.7998 1486.3619 1489.7938 1492.5527 1550.8459 1576.8708 1620.7233 2856.2055 2864.5070 2914.4882 2955.8691 2965.5551 2966.4095 2968.3943 2973.4795 2975.6304 2980.9465 2982.1897 3014.7908 3016.9567 3025.2123 3032.8196 3035.4464 3036.9585 3051.4985 3059.5776 3068.3765 3073.1305 3074.8592 3090.7867 3091.6855 3128.3385 3142.7633 3158.5319 3169.1334
redmass: 3.6530 3.8030 3.8411 3.4573 3.5752 2.7957 2.7610 2.0998 2.5037 2.7013 2.4288 2.8900 2.0821 2.1047 1.4296 2.8775 2.4574 1.9625 4.4865 2.5094 2.6664 3.2742 2.6359 2.8113 3.3309 3.3776 3.1237 4.2334 2.9746 2.3841 2.5387 2.6836 3.6790 5.3010 4.0478 5.1222 4.9405 4.7865 3.4173 2.7708 2.9016 1.4041 1.1568 1.1474 1.2795 2.8480 2.0464 2.1432 2.8449 2.6124 1.6955 3.7163 1.9399 4.6668 1.8746 2.3163 1.3658 2.2385 1.3186 2.2444 3.2308 2.3599 1.7412 2.5551 1.8777 1.9414 2.1776 2.7698 2.1415 1.9929 1.6980 1.3900 1.5736 1.3414 1.2424 1.3573 1.3193 2.2452 1.9506 1.9931 1.3156 1.3104 1.7288 1.1305 1.2351 1.2413 1.8107 1.5104 1.4691 1.7665 1.4794 1.6346 1.4467 1.3511 1.6975 2.0326 1.2328 2.2560 1.2996 1.7159 6.0951 2.2160 1.2630 1.0914 1.0601 1.0750 1.0766 1.0947 1.0666 1.0965 1.1099 1.2504 1.7735 1.0706 1.1130 1.1513 7.3244 8.5981 6.7364 1.0718 1.0713 1.0702 1.0609 1.0663 1.0665 1.0631 1.0572 1.0619 1.0358 1.0360 1.0962 1.0880 1.1025 1.0989 1.0887 1.1025 1.0938 1.0977 1.0939 1.0988 1.0980 1.1003 1.1003 1.0854 1.0893 1.0954 1.0997
irintensity: 0.0367 0.0174 0.0110 0.3606 1.2383 0.3076 0.3512 0.1494 1.1197 0.7139 1.1687 0.6033 0.3094 1.6267 0.1773 5.6339 1.0238 1.3169 1.7676 3.8102 0.7535 0.6144 1.1217 1.6495 1.5581 9.7909 0.1811 0.8033 10.9996 2.4297 0.5304 2.1719 1.0100 3.0611 4.2968 6.9350 1.4882 8.5433 2.9766 4.8513 0.3285 87.2060 9.3529 4.6286 6.6514 0.5892 4.0635 6.5407 2.4626 3.9410 1.7040 20.4572 0.6090 82.2533 5.5820 28.9993 1.9066 6.8887 0.0600 15.6575 105.3250 27.1854 31.7944 36.5186 6.7110 18.9343 2.6358 9.0332 7.2951 5.1320 7.1174 11.2173 6.4066 7.3513 13.0476 19.9995 0.1793 37.6064 4.3104 16.5595 5.5595 4.8676 12.2976 0.6792 30.1272 20.7576 47.1406 2.1438 2.2142 1.0603 5.3335 29.7556 0.7507 1.3113 1.9499 33.9497 18.7316 7.8646 26.3683 7.9180 23.5958 1.8522 7.9229 6.1945 4.1522 9.8236 2.3294 6.3314 5.2938 2.9730 16.8845 31.0443 50.9124 12.3388 6.5765 4.4390 20.3215 48.6480 7.2235 31.9462 183.6493 69.4185 35.3841 21.5132 29.8964 28.1042 39.1573 35.6882 29.1599 27.7231 79.1208 22.7822 31.5545 10.1305 15.3433 95.9719 24.8444 39.2084 17.2943 34.7804 90.2451 36.6876 45.6797 2.7062 10.2890 21.1670 29.0920
temp: 298.150 k
press: 1.00000 atm
elementType: 8 7 7 6 6 6 6 6 6 6 6 6 6 6 6 6 6 6 6 6 6 6 6 1 1 1 1 1 1 1 1 1 1 1 1 1 1 1 1 1 1 1 1 1 1 1 1 1 1 1 1
symmnumber: 1
zpe: 1152694.7 jmol-1
zpe.correction: 0.439038 hartree
zpe.thermalcorrener: 0.461903 hartree
zpe.thermalcorrenthalpy: 0.462847 hartree
zpe.thermalcorrgfe: 0.384057 hartree
zpe.sumelectzpe: -961.896581 hartree
zpe.sumelectthermal: -961.873717 hartree
zpe.sumelectthermalent: -961.872772 hartree
zpe.sumelectthermalfe: -961.951562 hartree
dipole: 3.3191 -1.4245 0.0766
dipole: 3.6127
quadrupole: -136.4393 -125.2539 -144.4207
quadrupole: 2.9526 -1.8554 2.4845
quadrupole: -1.0680 10.1174 -9.0494 2.9526 -1.8554 2.4845
hfenergy: -962.3356191 hartree
pointgroup: C01 [X(C20H28N2O1)]
dipole: -1.3012889 0.563436 0.096959 debye
polarizability: 263.8050784|-2.2429414|309.9703612|16.0099714|4.1700401|152.9502837 unknown
InChI: InChI=1S/C20H28N2O/c1-3-22(4-2)14-15-23-20-16-10-6-5-7-12-18(16)21-19-13-9-8-11-17(19)20/h8-9,11,13H,3-7,10,12,14-15H2,1-2H3
charge 0 multiplicity 1
51 atoms
O  -0.660505 -0.250563 -1.271336
N  3.34002 -0.315195 0.193659
N  -4.153443 0.17533 0.019268
C  0.549923 3.238765 0.248246
C  0.754872 2.283073 -0.964581
C  1.831973 3.975405 0.704153
C  1.378491 0.943915 -0.616162
C  2.98769 3.068149 1.188977
C  3.56245 2.107239 0.107616
C  2.7358 0.852595 -0.117449
C  0.664603 -0.25439 -0.770648
C  1.273825 -1.522428 -0.473483
C  2.633847 -1.498115 0.015825
C  -1.709066 -0.08054 -0.227199
C  -3.066663 -0.140345 -0.938765
C  0.608424 -2.776329 -0.650159
C  3.28137 -2.735532 0.327022
C  -5.361426 -0.675864 -0.137484
C  -4.452898 1.630815 0.094492
C  1.266386 -3.97014 -0.340014
C  2.609327 -3.949309 0.154856
C  -5.150037 -2.111905 0.378382
C  -5.033315 2.060837 1.455394
H  -0.204741 4.000116 -0.033817
H  0.122765 2.667921 1.097737
H  1.389039 2.802944 -1.712428
H  -0.21518 2.092995 -1.456987
H  2.200513 4.595495 -0.140541
H  1.567434 4.681898 1.516657
H  2.663845 2.47456 2.066938
H  3.812651 3.719582 1.538777
H  4.567893 1.767361 0.408623
H  3.673055 2.669821 -0.843275
H  -1.625506 -0.886741 0.526741
H  -1.568534 0.894055 0.282299
H  -3.04939 0.552604 -1.811943
H  -3.207873 -1.156751 -1.34659
H  -0.410124 -2.778314 -1.051577
H  -6.176314 -0.209885 0.445469
H  -5.7084 -0.702556 -1.201486
H  -3.504169 2.176531 -0.069922
H  -5.142429 1.9465 -0.729157
H  4.310805 -2.689641 0.695631
H  0.757397 -4.930156 -0.481066
H  3.112268 -4.893205 0.393139
H  -4.868337 -2.093646 1.445484
H  -4.34923 -2.634601 -0.176334
H  -6.076724 -2.704781 0.264024
H  -4.331965 1.800087 2.266996
H  -5.998465 1.566726 1.669544
H  -5.20763 3.153014 1.472455
