program: Gaussian 09
title: 000237172
version: EM64L-G09RevD.01
frameworkgroup: C1[X(C10H8S3)]
method: RPBEPBE
basis: SDD
operation: Freq
keyword: #pfreq=noraman
keyword: PBEPBE/SDD
title: #p freq=noraman PBEPBE/SDD
converged: NO YES NO NO
title: Mulliken charges:
elementType: S S S C C C C C C C C C C H H H H H H H H
charge: 0.191949 0.125814 0.126825 0.372755 0.804399 0.438233 -0.395651 -0.373426 -0.386766 -0.384826 -0.805023 -0.934878 -0.735997 0.242371 0.260701 0.232339 0.233625 0.227174 0.225446 0.240091 0.294843
chargesum: 0.00000
title: Mulliken charges with hydrogens summed into heavy atoms:
elementType: S S S C C C C C C C C C C
charge: 0.191949 0.125814 0.126825 0.372755 0.804399 0.438233 -0.153279 -0.112725 -0.154427 -0.151201 -0.112313 -0.934878 -0.441154
polarizability: 2.40762001e+02 2.42155574e+01 1.85829729e+02 -4.05707986e+00 2.20313541e+00 7.94428479e+01
1716.lowfreq: -31.4628 -8.9316 -3.4669 0.0012 0.0018 0.0018 5.5031 52.0891 59.5820
frequency: -30.5021 52.0709 59.5772 81.4800 127.3130 168.8668 220.4523 257.3304 285.2329 321.3582 338.3880 347.7171 371.4240 404.1745 409.3441 504.1688 553.2601 593.7154 629.3773 657.4778 722.7527 758.8006 785.4791 817.5269 820.8445 846.7087 849.5919 954.1163 967.6225 973.3419 986.6334 1014.4806 1047.2484 1125.6636 1133.9464 1197.0768 1224.5868 1237.7564 1305.1617 1338.6886 1364.9439 1397.6909 1407.6433 1468.8655 1471.9236 1480.7505 1519.2615 1573.0283 1620.6948 2975.9078 3057.4108 3085.9536 3118.2424 3126.7290 3141.9738 3163.4734 3168.4340
redmass: 1.0199 4.8386 5.5023 7.3374 9.5063 5.7157 7.8544 8.6495 4.5457 5.6282 5.8511 9.2042 7.0641 4.0741 3.4862 3.2227 6.2519 6.3090 6.2775 5.0525 3.2352 5.6774 3.2764 4.9865 1.6816 1.3111 1.6015 1.3291 3.9564 1.6936 1.4039 2.8511 1.5702 1.3234 3.0866 1.1063 3.1058 1.6037 1.3930 3.2217 5.6338 1.2232 3.2828 1.1548 1.0557 3.4815 3.7914 5.9908 6.3678 1.0387 1.0949 1.0998 1.0871 1.0894 1.0966 1.0955 1.0920
irintensity: 0.6413 0.0709 0.5471 0.3213 0.3980 0.5366 1.8022 2.0662 1.9124 9.3233 7.2712 1.4203 2.9505 2.1477 2.2876 10.0838 9.5315 9.6001 0.9724 0.8853 1.1807 27.8017 27.6548 20.3412 55.3619 0.3101 5.7723 0.8121 24.6524 2.9136 0.6420 5.9897 20.0879 8.6899 9.4884 4.6152 1.4140 2.0781 15.5214 45.6203 10.8608 10.8776 1.7235 18.7197 12.6423 23.3145 21.9207 1.8022 14.2055 34.6030 21.8359 17.0616 11.7798 21.5954 16.9128 3.4508 2.2220
temp: 298.150 k
press: 1.00000 atm
elementType: 16 16 16 6 6 6 6 6 6 6 6 6 6 1 1 1 1 1 1 1 1
symmnumber: 1
zpe: 386595.3 jmol-1
zpe.correction: 0.147246 hartree
zpe.thermalcorrener: 0.159106 hartree
zpe.thermalcorrenthalpy: 0.160050 hartree
zpe.thermalcorrgfe: 0.107839 hartree
zpe.sumelectzpe: -1579.130478 hartree
zpe.sumelectthermal: -1579.118618 hartree
zpe.sumelectthermalent: -1579.117674 hartree
zpe.sumelectthermalfe: -1579.169886 hartree
dipole: 2.4771 -2.7839 0.4919
dipole: 3.7587
quadrupole: -88.2789 -96.9697 -99.6358
quadrupole: 3.0889 -0.7000 4.1426
quadrupole: 6.6826 -2.0083 -4.6743 3.0889 -0.7000 4.1426
hfenergy: -1579.2777242 hartree
pointgroup: C01 [X(C10H8S3)]
dipole: 0.9763808 1.0146141 0.4517512 debye
dipolederiv: -0.2358809 -0.0141869 -0.0140191 -0.2499244 0.5307554 0.1987264 -0.1965401 0.217312 0.1496603 -0.5024518 0.3126531 0.1239028 0.3335575 -0.4102055 -0.182018 0.2696155 -0.225667 -0.023933 -0.2823601 0.271569 0.0953237 0.160544 -0.565406 -0.200244 0.0990548 -0.2186197 -0.1600429 0.0437842 0.0736142 0.0463649 -0.118688 -0.0313018 -0.005358 0.0068707 -0.0305647 -0.0128684 0.2729147 -0.0547287 -0.0158927 -0.0383576 -0.5118742 -0.2941815 0.0113587 -0.2864898 -0.0579731 0.4909852 -0.0454575 0.0133942 -0.1392293 -0.0199006 -0.0073711 -0.0305709 0.00595 -0.0209009 0.0204291 -0.0309187 -0.0517909 0.0698063 -0.1254825 0.0499981 0.0582992 0.0293575 0.0321007 -0.0117247 0.0009346 0.0532632 -0.0116238 -0.050242 0.0814217 -0.0330655 0.0030014 0.0123466 -0.2875894 0.0269713 0.0662163 0.0688947 -0.1461064 0.0608031 0.2154863 0.071154 0.0582512 -0.1831057 -0.0451749 -0.0931583 -0.0705468 -0.1149195 0.0957473 -0.1860148 0.0915233 0.0478285 -0.1806797 0.0251941 -0.0068227 0.163039 0.05981 0.0107425 -0.050829 0.0133436 0.0783839 0.3826397 -0.0771 -0.0005559 -0.0565258 0.5915467 0.3226349 0.0001095 0.3645462 -0.0568378 0.3646212 -0.4042721 -0.1872189 -0.0497945 0.1983042 0.1633338 -0.0913553 0.1727981 -0.1498277 0.0267379 0.0428042 0.0993118 0.0200841 0.1219572 -0.0580739 0.0854634 -0.0279755 -0.0091299 0.0686419 -0.0168864 -0.0819123 0.0134524 0.0928346 -0.0633281 -0.1074263 -0.0070455 0.0184475 -0.0042795 -0.0292577 -0.094337 -0.0363256 0.1300472 -0.0608008 -0.0995772 -0.0578251 -0.0376311 -0.0020696 0.025087 0.086665 0.035968 0.1207238 -0.0654964 0.0999935 -0.0628645 -0.0298121 0.0092664 -0.0115054 0.0323046 -0.0433559 0.1042721 0.0185779 0.1335647 0.0374524 -0.1031397 0.0061616 -0.0264702 -0.0205278 -0.1165504 0.0014181 -0.1000355 -0.0824117 -0.1145531 0.0030842 -0.0369125 0.0439903 -0.0180001 0.0989512 -0.0800802 0.0656672 -0.0315432 0.0622819 0.0915969 0.0408721 -0.0668592 -0.0325107 -0.0333751 0.1038494 -0.0307453 -0.0704821 -0.0371158 0.1703969 unknown
polarizability: 240.5787766|-24.6603259|153.2110889|-6.2630769|48.888816|112.2447124 unknown
InChI: InChI=1S/C10H8S3/c1-7-2-4-8(5-3-7)9-6-12-13-10(9)11/h2-6H,1H3
charge 0 multiplicity 1
21 atoms
S  -3.898763 -0.527297 -0.432903
S  -3.685629 1.589902 0.572278
S  -1.726108 -2.336795 -1.175686
C  0.204215 0.171474 -0.008689
C  -1.284071 0.270012 -0.01335
C  3.071524 0.047951 0.017561
C  0.939639 0.542973 1.148288
C  0.922243 -0.265239 -1.15327
C  2.348559 0.486025 1.157588
C  2.331262 -0.322848 -1.134919
C  4.586376 -0.049255 0.040439
C  -2.123127 -0.804705 -0.522326
C  -1.912751 1.40113 0.492044
H  0.402653 0.853511 2.052575
H  0.3786 -0.546475 -2.059981
H  2.894517 0.775316 2.063766
H  2.865944 -0.656492 -2.032358
H  5.018541 0.11603 -0.962208
H  5.030914 0.688511 0.731437
H  4.913335 -1.052571 0.376774
H  -1.349872 2.26654 0.855039
