program: Gaussian 09
title: 000237137
version: EM64L-G09RevD.01
frameworkgroup: C1[X(C16H18O4)]
method: RPBEPBE
basis: SDD
operation: Freq
keyword: #pfreq=noraman
keyword: PBEPBE/SDD
title: #p freq=noraman PBEPBE/SDD
converged: YES YES NO NO
title: Mulliken charges:
elementType: O O O O C C C C C C C C C C C C C C C C H H H H H H H H H H H H H H H H H H
charge: -0.444379 -0.209274 -0.244098 -0.415566 -0.118717 -0.479968 -0.478555 -0.088708 -0.437527 -0.413843 0.121473 -0.248913 -0.249419 0.087302 0.314417 -0.308701 -0.325913 -0.367681 -0.389722 0.292672 0.222469 0.215753 0.226712 0.235290 0.215172 0.225704 0.193945 0.230014 0.231665 0.192933 0.329496 0.268446 0.251083 0.233449 0.281752 0.259472 0.228365 0.363399
chargesum: 0.00000
title: Mulliken charges with hydrogens summed into heavy atoms:
elementType: O O O O C C C C C C C C C C C C C C C C
charge: -0.114883 -0.209274 -0.244098 -0.052166 0.103753 -0.037503 -0.028093 0.136996 -0.013568 0.010756 0.121473 0.019533 0.001664 0.087302 0.314417 -0.075252 -0.044161 -0.108210 -0.161357 0.292672
polarizability: 3.44267072e+02 -9.25436616e+00 1.73907383e+02 1.33022558e+01 -7.38345209e+00 1.07475808e+02
1716.lowfreq: -12.8604 -7.0665 -4.8590 -0.0003 0.0008 0.0010 9.2420 20.8312 32.2540
frequency: 9.0655 20.4109 32.0873 39.6025 70.6035 93.8587 108.1011 129.0756 149.3895 180.7624 202.6123 212.6626 221.5684 228.7889 291.0396 295.1942 308.4314 360.6885 377.1388 380.7424 392.2377 403.6698 416.1665 445.7265 469.1683 499.4334 511.0233 587.6639 615.0672 630.6369 633.3682 681.5332 705.6469 751.5085 768.6357 774.7718 798.8778 812.1499 819.6356 842.7988 843.5880 894.8410 917.2432 922.2184 924.5010 927.5779 961.7197 984.7734 986.0043 997.0690 1006.0731 1016.8128 1042.0005 1063.7071 1074.1451 1079.0519 1104.6364 1110.9264 1146.6011 1147.1625 1175.4555 1178.9017 1192.6193 1220.7395 1239.3641 1255.7929 1257.9899 1270.6215 1288.1718 1289.5442 1303.7617 1318.3048 1325.7080 1338.6764 1339.8960 1350.3801 1361.1432 1371.3259 1392.7180 1433.5613 1444.9534 1455.3091 1465.8301 1477.9319 1500.6223 1519.7431 1565.0357 1585.2587 1622.2123 1647.9381 2949.2808 2972.5480 2975.7809 2980.3095 2983.2383 3036.8361 3043.4584 3049.9494 3050.9276 3054.4290 3120.0867 3123.4368 3144.0518 3160.1246 3162.4457 3180.2810 3555.7782 3575.1830
redmass: 6.0704 4.3218 5.4236 5.2672 5.1453 4.8382 7.0634 4.6127 4.1351 2.7176 4.4709 3.0782 1.5630 1.9539 4.2833 5.3069 7.6098 4.1507 2.5251 2.6595 2.7932 1.6673 1.5698 2.9674 3.5132 2.7956 4.0442 7.3508 3.4373 6.4472 3.0317 3.8632 5.3680 3.8036 1.5475 4.0720 3.1884 3.7887 1.2615 1.7534 4.0478 2.4407 2.5614 2.1563 1.7140 2.9711 1.3846 2.9687 1.3606 2.9752 1.1118 2.7444 2.0537 1.9965 1.6325 1.4059 1.4363 1.4970 1.3499 1.8403 1.3108 1.1271 1.4351 1.6586 1.7648 1.4138 1.9884 1.3670 1.7942 1.4267 1.5785 1.4748 1.5627 1.5649 1.3744 1.6994 1.4705 1.2288 3.9659 4.3425 1.0854 1.0885 1.0837 1.0853 2.8421 9.5514 9.5222 6.2925 6.3691 6.2706 1.0807 1.0648 1.0631 1.0649 1.0631 1.0974 1.0942 1.0959 1.0940 1.0999 1.0901 1.0914 1.0903 1.0875 1.0942 1.0967 1.0655 1.0661
irintensity: 0.6399 0.1906 0.6509 1.3296 3.4927 0.8771 3.3841 0.6256 2.6865 0.3282 2.5226 27.1663 82.9124 39.8787 2.9945 0.6094 0.3093 5.6155 5.2326 0.6331 1.6320 71.0521 78.0370 3.2900 4.4503 21.7015 16.7316 64.9424 6.5322 1.4156 10.2126 12.8778 9.7147 9.8458 0.7371 14.9325 4.6578 13.1386 2.1789 59.4394 11.7732 14.2736 17.1536 7.2857 16.6963 28.5501 1.8114 3.1989 2.0046 22.8373 41.5076 15.3838 6.8694 78.0042 21.6852 9.2617 190.9814 11.9638 273.8073 28.1905 19.7647 104.6285 15.0017 12.9257 8.4871 20.8292 8.2123 5.6015 337.5613 18.6926 197.3394 45.3087 2.1848 83.9585 0.4842 79.3268 14.5520 17.2397 81.8276 28.2077 8.7545 14.1940 8.2473 16.4791 3.0128 138.1763 79.2556 87.3239 236.1598 2.2050 11.4439 23.7642 9.2850 35.2320 30.7167 48.6918 33.5142 34.8204 38.6054 61.4109 17.5852 1.5644 2.5869 7.3724 4.0957 5.6161 3.4621 90.5503
temp: 298.150 k
press: 1.00000 atm
elementType: 8 8 8 8 6 6 6 6 6 6 6 6 6 6 6 6 6 6 6 6 1 1 1 1 1 1 1 1 1 1 1 1 1 1 1 1 1 1
symmnumber: 1
zpe: 799882.1 jmol-1
zpe.correction: 0.304659 hartree
zpe.thermalcorrener: 0.323943 hartree
zpe.thermalcorrenthalpy: 0.324888 hartree
zpe.thermalcorrgfe: 0.253742 hartree
zpe.sumelectzpe: -919.896807 hartree
zpe.sumelectthermal: -919.877523 hartree
zpe.sumelectthermalent: -919.876579 hartree
zpe.sumelectthermalfe: -919.947725 hartree
dipole: 4.0148 1.5274 -0.9274
dipole: 4.3945
quadrupole: -98.7490 -123.6455 -121.4597
quadrupole: 0.1521 11.2657 0.2629
quadrupole: 15.8690 -9.0274 -6.8416 0.1521 11.2657 0.2629
hfenergy: -920.2014662 hartree
pointgroup: C01 [X(C16H18O4)]
dipole: 1.5753842 0.6790172 -0.215235 debye
polarizability: 344.4688165|-11.3425733|173.3631617|9.5811648|9.2092882|107.818285 unknown
InChI: InChI=1S/C16H18O4/c17-13-5-1-11(2-6-13)15(19)9-10-16(20)12-3-7-14(18)8-4-12/h1-2,5-6,9-10,12,14,17-18H,3-4,7-8H2
charge 0 multiplicity 1
38 atoms
O  -6.387114 -0.938752 1.23593
O  -1.66724 -1.766844 -0.673863
O  1.514739 2.1759 0.045162
O  7.14792 -0.950661 0.201311
C  -3.22935 0.115037 -0.492633
C  -4.312411 -0.788258 -1.1212
C  -3.599004 0.471824 0.986361
C  -6.0935 0.255864 0.411513
C  -5.712875 -0.134284 -1.035597
C  -4.996807 1.129981 1.064144
C  -1.837567 -0.519628 -0.517111
C  -0.683181 0.408804 -0.306988
C  0.608377 -0.027881 -0.268389
C  1.745408 0.924981 -0.069312
C  3.140729 0.397644 -0.005991
C  3.474858 -0.985189 -0.105442
C  4.196222 1.337595 0.167812
C  4.810571 -1.414048 -0.033917
C  5.534269 0.923914 0.239682
C  5.841503 -0.459561 0.138333
H  -3.177653 1.074692 -1.052435
H  -4.29888 -1.772807 -0.612124
H  -4.060232 -1.003954 -2.175919
H  -2.841626 1.147413 1.426362
H  -3.579418 -0.456731 1.59297
H  -7.054536 0.799037 0.416935
H  -5.731817 0.778985 -1.66478
H  -6.481043 -0.821675 -1.435351
H  -5.268261 1.315024 2.1197
H  -4.970385 2.112953 0.550901
H  -5.615867 -1.559406 1.189212
H  -0.882268 1.482663 -0.191427
H  0.790855 -1.101345 -0.390339
H  2.697025 -1.742627 -0.237563
H  3.928386 2.396367 0.244078
H  5.077027 -2.471918 -0.108171
H  6.335752 1.661886 0.373112
H  7.804096 -0.219292 0.321831
