program: Gaussian 09
title: 000237143
version: EM64L-G09RevD.01
frameworkgroup: C1[X(C17H13BrClNO)]
method: RPBEPBE
basis: SDD
operation: Freq
keyword: #p
keyword: freq=noraman
keyword: PBEPBE/SDD
title: #p freq=noraman PBEPBE/SDD
converged: YES YES NO NO
title: Mulliken charges:
elementType: Br Cl O N C C C C C C C C C C C C C C C C C H H H H H H H H H H H H H
charge: -0.018380 -0.019846 -0.459217 -0.016856 0.374522 0.285344 -0.180285 -0.010984 -0.425457 0.052990 -0.405755 0.331799 -0.726663 -0.248623 -0.265504 -0.254916 -0.364470 -0.372547 -0.230360 -0.250394 -0.236648 0.246586 0.279876 0.235239 0.308635 0.311751 0.237067 0.260100 0.291098 0.223289 0.361940 0.229176 0.227181 0.230313
chargesum: 0.00000
title: Mulliken charges with hydrogens summed into heavy atoms:
elementType: Br Cl O N C C C C C C C C C C C C C C C C C
charge: -0.018380 -0.019846 -0.097277 -0.016856 0.374522 0.285344 0.066300 -0.010984 -0.145581 0.052990 -0.170517 0.331799 -0.106277 -0.248623 -0.028437 0.005185 -0.073372 -0.149258 -0.001185 -0.023213 -0.006335
polarizability: 3.32375792e+02 -3.84742825e+01 3.02746374e+02 -2.09549680e+01 -6.08386410e+00 9.70970066e+01
1716.lowfreq: -4.8043 -2.7714 -0.0016 0.0011 0.0018 3.8930 21.2600 29.8762 40.1984
frequency: 21.1127 29.8470 40.1600 50.8563 81.8367 88.8021 121.7736 153.5392 168.5944 173.9203 199.3113 211.6793 232.0503 278.3930 298.9390 328.4510 381.7202 388.6260 401.4416 402.5783 437.1159 465.0026 490.2802 514.5090 531.5501 557.6829 576.2608 581.2576 616.2839 635.3739 686.5919 691.0951 695.6937 699.1280 762.3765 788.7477 803.2859 818.0386 827.6992 849.6306 855.6096 887.9302 898.5006 933.5383 941.8437 968.2352 971.8913 988.5527 989.3333 1012.8489 1022.4815 1032.5909 1058.0121 1059.4567 1079.6907 1091.0728 1137.5162 1160.8062 1172.6470 1187.3505 1197.6271 1202.7943 1220.8143 1245.0359 1275.7907 1296.2126 1307.9301 1325.5080 1355.0198 1366.0460 1381.3372 1387.6680 1414.1143 1425.4550 1427.4514 1443.6368 1485.2521 1505.5924 1531.8906 1584.4707 1594.0890 1605.6937 1615.1179 2973.2238 3066.1751 3126.2905 3133.2632 3136.4376 3149.3310 3155.7468 3158.6895 3160.8606 3170.4830 3175.3377 3195.8332 3527.5284
redmass: 3.9420 8.9293 10.1805 6.0749 5.8817 5.6506 5.2746 9.9914 6.9713 5.1173 4.4084 5.7583 4.9159 6.7645 5.2087 6.3103 1.2697 7.7163 2.8287 3.5380 3.4789 3.4995 4.0316 6.7232 6.4144 3.5650 7.5365 5.0870 6.4212 6.2230 4.4819 5.7310 2.1153 3.0176 1.5119 2.0598 4.7463 3.6008 2.5604 5.2356 1.2694 4.3450 1.4096 1.5470 1.4559 1.9526 1.4151 2.4082 2.0842 1.3456 2.8335 3.4494 3.1546 3.4225 1.9508 1.8434 1.2517 1.6340 1.0629 1.2000 1.4340 1.2507 1.1956 1.4897 2.6419 1.8786 1.6226 1.5690 4.2568 3.2750 1.7290 6.2874 2.6422 1.5423 1.8784 2.5374 2.6954 3.5700 7.7227 6.5848 6.7437 6.2895 6.4107 1.0836 1.0563 1.0848 1.0870 1.0884 1.0933 1.0937 1.1105 1.0964 1.0995 1.0976 1.0905 1.0655
irintensity: 0.0094 0.3623 0.7782 0.7230 0.5735 1.8855 2.3391 0.8236 4.2618 4.4557 0.6186 1.3409 1.0499 1.6129 4.3644 0.6477 126.8327 7.9723 7.0001 27.7792 8.5111 3.8528 0.9407 42.8391 12.9224 2.6074 7.2231 10.4646 0.1626 29.6375 14.6094 18.4635 27.7712 54.5895 64.6235 30.9871 13.1424 26.7555 0.9510 5.3423 0.7997 21.9991 1.3988 17.7818 3.5053 15.1922 2.1789 0.8702 0.1733 1.0035 11.0226 4.5478 61.2643 28.8735 15.2330 6.4791 33.5727 12.1750 1.0401 11.4981 15.5122 20.5515 20.0966 9.5834 4.2584 23.6690 18.7951 3.0287 80.7452 2.9664 24.8878 14.2457 36.0444 27.6468 12.4122 26.3159 13.5990 38.4482 52.6599 29.6402 80.6517 3.3617 0.3548 22.3102 5.7524 1.1256 7.5676 7.8258 31.4938 15.3754 2.8266 18.7653 27.8355 10.2249 0.4220 15.8318
temp: 298.150 k
press: 1.00000 atm
elementType: 35 17 8 7 6 6 6 6 6 6 6 6 6 6 6 6 6 6 6 6 6 1 1 1 1 1 1 1 1 1 1 1 1 1
symmnumber: 1
zpe: 663059.5 jmol-1
zpe.correction: 0.252546 hartree
zpe.thermalcorrener: 0.270876 hartree
zpe.thermalcorrenthalpy: 0.271820 hartree
zpe.thermalcorrgfe: 0.203058 hartree
zpe.sumelectzpe: -1257.650768 hartree
zpe.sumelectthermal: -1257.632438 hartree
zpe.sumelectthermalent: -1257.631494 hartree
zpe.sumelectthermalfe: -1257.700256 hartree
dipole: -2.2777 -0.3132 -0.0459
dipole: 2.2996
quadrupole: -136.6523 -123.7405 -143.4915
quadrupole: -12.0909 -4.3213 0.6717
quadrupole: -2.0242 10.8875 -8.8634 -12.0909 -4.3213 0.6717
hfenergy: -1257.903314 hartree
pointgroup: C01 [X(C17H13Br1Cl1N1O1)]
dipole: 0.677547 0.5934379 0.0854451 debye
polarizability: 359.4203259|-1.8250721|261.6056206|4.9961279|52.0992444|111.1932262 unknown
InChI: InChI=1S/C17H13BrClNO/c18-10-16(21)13-9-15(11-5-2-1-3-6-11)20-17-12(13)7-4-8-14(17)19/h1-9,16,21H,10H2
charge 0 multiplicity 1
34 atoms
Br 4.140197 4.062628 0.117598
Cl 0.14176 -3.956362 -1.371581
O  1.389679 2.976424 1.620828
N  -0.546871 -1.181451 -0.402798
C  1.244814 0.858252 0.461531
C  1.77865 -0.419443 0.049695
C  2.175974 1.995486 0.876155
C  0.808157 -1.412085 -0.385518
C  -0.132552 1.063316 0.443308
C  -1.02202 0.019668 0.008012
C  3.172487 -0.747564 0.055102
C  -2.501489 0.204476 -0.025489
C  2.782725 2.62765 -0.394004
C  1.311568 -2.690515 -0.812064
C  3.607161 -2.007503 -0.363321
C  2.672193 -2.99091 -0.806711
C  -3.318224 -0.834652 -0.553699
C  -3.13007 1.386248 0.455104
C  -4.718592 -0.693482 -0.603642
C  -4.533429 1.525297 0.405554
C  -5.33459 0.488182 -0.125011
H  2.99554 1.604341 1.51395
H  -0.509926 2.030318 0.777787
H  3.911237 -0.017152 0.40216
H  3.343855 1.911674 -1.010884
H  2.017162 3.153601 -0.983653
H  4.673351 -2.255585 -0.351382
H  3.017406 -3.975211 -1.1355
H  -2.823255 -1.740727 -0.915429
H  -2.536981 2.203007 0.878847
H  1.975539 3.750954 1.828271
H  -5.332149 -1.502799 -1.014811
H  -5.001363 2.441329 0.782834
H  -6.424148 0.598287 -0.163339
