program: Gaussian 09
title: 000237140
version: EM64L-G09RevD.01
frameworkgroup: C1[X(C17H12BrCl2NO)]
method: RPBEPBE
basis: SDD
operation: Freq
keyword: #p
keyword: freq=noraman
keyword: PBEPBE/SDD
title: #p freq=noraman PBEPBE/SDD
converged: YES YES NO NO
title: Mulliken charges:
elementType: Br Cl Cl O N C C C C C C C C C C C C C C C C C H H H H H H H H H H H H
charge: -0.013106 -0.041559 -0.051646 -0.459856 -0.056942 0.384764 0.270792 -0.182661 -0.084345 -0.426480 0.027784 -0.382313 0.364502 -0.725725 -0.299142 -0.258257 -0.115295 -0.355559 -0.363137 -0.219298 -0.228720 -0.111733 0.247037 0.277730 0.238296 0.311627 0.306689 0.290703 0.260663 0.288002 0.230429 0.363593 0.256831 0.256333
chargesum: 0.00000
title: Mulliken charges with hydrogens summed into heavy atoms:
elementType: Br Cl Cl O N C C C C C C C C C C C C C C C C C
charge: -0.013106 -0.041559 -0.051646 -0.096263 -0.056942 0.384764 0.270792 0.064376 -0.084345 -0.148749 0.027784 -0.144018 0.364502 -0.107409 -0.008440 0.002406 -0.115295 -0.067557 -0.132708 0.037533 0.027613 -0.111733
polarizability: 4.01471826e+02 -4.56853303e+01 2.97805717e+02 -1.09891320e+01 -1.70467391e+01 9.88374232e+01
1716.lowfreq: -4.6851 -0.0008 0.0021 0.0022 2.0698 2.4192 9.7494 24.2131 36.8119
frequency: 9.3397 24.1843 36.8056 56.6386 62.7749 72.7979 103.2761 122.1602 148.7722 157.6211 194.3242 200.3641 229.8669 251.1897 261.5612 285.5360 305.9991 335.2925 363.8267 378.2422 402.5311 406.9915 434.4679 443.9582 463.5454 488.5364 522.2066 553.2823 570.3451 589.1661 604.5968 626.8922 640.9265 665.5769 674.6494 716.5376 730.4438 760.8754 777.1915 820.7518 827.1802 830.3090 852.1320 885.6599 887.6026 897.1224 925.9583 956.0969 958.8664 963.5763 995.9046 997.2166 1017.6274 1051.9624 1058.2630 1070.9983 1075.1136 1111.2154 1137.5897 1152.9686 1182.7450 1197.9996 1214.4129 1228.1912 1251.9470 1259.1343 1296.1311 1298.7833 1311.3784 1354.7756 1359.5012 1382.3011 1384.5451 1398.8311 1411.0855 1425.5952 1432.2550 1481.9074 1504.8533 1534.5496 1578.3630 1591.1544 1597.4649 1609.5792 2971.6363 3065.2915 3137.0237 3151.5427 3157.1629 3159.0883 3173.0930 3174.0478 3178.0964 3182.3817 3194.6763 3530.1555
redmass: 3.7444 14.7291 15.1077 6.3264 10.1781 6.4186 7.2741 5.1345 7.0142 10.2253 5.4888 7.3679 10.4642 5.9665 6.1610 6.6670 6.8971 6.0754 5.7939 1.2366 3.2079 2.8986 4.8354 5.5630 3.1613 3.2340 5.7572 5.4995 5.2357 4.5092 8.6684 7.0502 6.7512 4.8639 4.5067 5.8929 3.3558 4.6808 2.2542 1.9202 1.6586 1.7633 1.4892 5.3579 5.7786 1.4995 1.6048 1.4232 1.3580 2.0281 1.9635 2.1518 3.1717 5.2207 2.2127 3.5456 2.3442 1.3682 1.2670 1.4877 1.1959 1.2782 1.2595 1.3924 2.5388 1.4796 1.6363 1.3486 1.9568 3.9681 2.5270 2.7532 3.5399 4.1905 3.8205 1.2889 2.4038 2.7612 3.8386 9.4727 7.9032 6.7692 6.4630 7.0356 1.0837 1.0563 1.0888 1.0883 1.1112 1.0887 1.0963 1.0958 1.0972 1.0934 1.0904 1.0655
irintensity: 0.0006 0.0904 0.3263 0.6763 0.0301 1.1711 1.7261 0.7081 1.9370 2.6253 1.3494 3.8813 1.2027 0.1419 4.6960 1.4208 5.0008 0.7516 7.2101 129.1727 38.5845 0.3114 15.9346 13.8584 8.8323 27.0887 56.3271 15.7286 7.3524 2.5107 10.3918 3.5842 4.1631 16.8861 16.1822 11.6167 12.0751 12.3192 9.6222 11.2519 9.5271 16.0199 61.5917 76.9188 19.2186 20.3566 19.8578 2.9062 1.0535 20.2621 31.2745 31.9113 8.5967 42.1301 1.4271 28.2875 80.4754 11.9113 26.8438 21.2370 10.2863 38.3753 20.7773 9.7056 8.4437 12.7093 11.3136 14.2413 13.1799 79.3245 21.4403 45.0509 3.2140 12.1638 22.4095 34.5245 40.5920 76.2410 46.4622 41.5956 24.1936 198.2767 41.1535 42.1743 22.8855 6.1273 15.1338 7.3265 1.8418 0.3748 6.6994 3.8901 4.8483 0.8572 0.4459 16.0651
temp: 298.150 k
press: 1.00000 atm
elementType: 35 17 17 8 7 6 6 6 6 6 6 6 6 6 6 6 6 6 6 6 6 6 1 1 1 1 1 1 1 1 1 1 1 1
symmnumber: 1
zpe: 637065.8 jmol-1
zpe.correction: 0.242646 hartree
zpe.thermalcorrener: 0.262360 hartree
zpe.thermalcorrenthalpy: 0.263304 hartree
zpe.thermalcorrgfe: 0.190067 hartree
zpe.sumelectzpe: -1717.044520 hartree
zpe.sumelectthermal: -1717.024806 hartree
zpe.sumelectthermalent: -1717.023862 hartree
zpe.sumelectthermalfe: -1717.097099 hartree
dipole: -2.7294 -1.5656 0.0384
dipole: 3.1468
quadrupole: -160.0013 -154.0826 -154.7795
quadrupole: 2.3599 -3.1618 -2.4095
quadrupole: -3.7135 2.2052 1.5083 2.3599 -3.1618 -2.4095
hfenergy: -1717.2871657 hartree
pointgroup: C01 [X(C17H12Br1Cl2N1O1)]
dipole: 0.8731709 0.8653913 0.1462693 debye
polarizability: 417.4017619|-10.2178791|267.297011|-10.5524409|53.2308083|113.4161933 unknown
InChI: InChI=1S/C17H12BrCl2NO/c18-9-17(22)14-8-15(10-1-3-11(19)4-2-10)21-16-7-12(20)5-6-13(14)16/h1-8,17,22H,9H2
charge 0 multiplicity 1
34 atoms
Br 3.654755 4.672199 0.166958
Cl 4.074071 -4.038078 -1.357617
Cl -6.959838 -0.392532 -0.173818
O  1.090686 3.162271 1.640771
N  -0.181615 -1.235885 -0.408987
C  1.280231 1.061208 0.46219
C  1.998358 -0.118191 0.04585
C  2.023147 2.324546 0.889532
C  1.199714 -1.24907 -0.389361
C  -0.11309 1.048636 0.442003
C  -0.83099 -0.118721 0.003838
C  3.42565 -0.245417 0.042804
C  -2.321452 -0.157782 -0.025322
C  2.530528 3.058762 -0.369404
C  1.849727 -2.451387 -0.82164
C  4.046068 -1.424826 -0.377385
C  3.237974 -2.515898 -0.810713
C  -2.977393 -1.306378 -0.549868
C  -3.12099 0.914536 0.457236
C  -4.381929 -1.387205 -0.5995
C  -4.529425 0.849091 0.415844
C  -5.141163 -0.302594 -0.114893
H  2.890923 2.05702 1.527755
H  -0.634759 1.944638 0.780187
H  4.058128 0.581158 0.384674
H  1.695953 3.470649 -0.956226
H  3.193959 2.443468 -0.993589
H  1.225245 -3.287192 -1.145797
H  5.135373 -1.520838 -0.372644
H  -2.357706 -2.130323 -0.914174
H  -2.661759 1.81282 0.880288
H  1.550091 4.011631 1.872034
H  -4.878151 -2.27326 -1.005639
H  -5.138123 1.676446 0.791315
