program: Gaussian 09
title: 000237144
version: EM64L-G09RevD.01
frameworkgroup: C1[X(C17H19Cl2NO)]
method: RPBEPBE
basis: SDD
operation: Freq
keyword: #p
keyword: freq=noraman
keyword: PBEPBE/SDD
title: #p freq=noraman PBEPBE/SDD
converged: YES YES NO NO
title: Mulliken charges:
elementType: Cl Cl O N C C C C C C C C C C C C C C C C C H H H H H H H H H H H H H H H H H H H
charge: -0.023347 -0.017627 -0.474628 -0.200706 -0.423846 -0.198730 -0.511570 -0.294434 0.492575 0.487142 -0.684659 -0.367934 -0.434835 -0.449972 -0.357625 -0.061109 -0.203090 -0.220222 -0.232605 -0.109000 -0.236998 0.265623 0.213028 0.204323 0.208782 0.221729 0.221476 0.197858 0.214280 0.229351 0.220836 0.309952 0.238335 0.368176 0.233123 0.232053 0.255055 0.227997 0.230032 0.231212
chargesum: 0.00000
title: Mulliken charges with hydrogens summed into heavy atoms:
elementType: Cl Cl O N C C C C C C C C C C C C C C C C C
charge: -0.023347 -0.017627 -0.106453 -0.200706 0.054805 0.005593 -0.081059 0.124899 0.492575 0.487142 -0.020192 -0.057982 -0.196501 -0.216849 -0.125573 -0.061109 0.051965 0.007775 -0.002573 -0.109000 -0.005786
polarizability: 2.28798669e+02 -3.39909250e+01 2.23127844e+02 1.23980369e+01 2.00692955e+01 1.70660348e+02
1716.lowfreq: -6.1062 -0.0017 0.0009 0.0012 3.6672 7.5636 13.8642 18.8964 31.8506
frequency: 13.7189 18.6921 31.8201 35.6109 49.5648 59.8666 70.2947 118.8979 122.3704 150.1753 163.3598 176.7710 189.0804 227.3402 236.4952 239.2622 284.9639 317.9279 345.5710 349.6035 401.0218 404.4678 407.6609 417.9975 442.6550 458.1408 469.9069 494.5955 559.2538 587.6383 604.6754 617.1264 653.1448 681.5998 698.2314 706.9313 723.7934 748.2070 789.4094 795.9207 816.3700 821.7726 847.0541 860.3902 902.1127 918.0790 922.9523 950.1130 956.8383 979.4256 983.5995 991.2262 1000.4748 1003.1236 1025.8899 1026.4463 1040.7146 1053.2140 1084.6170 1098.9161 1109.9423 1117.8286 1144.1083 1169.7962 1173.4955 1186.8507 1197.6344 1215.5219 1236.3508 1239.2310 1245.3011 1271.5636 1280.5882 1301.3409 1323.8080 1349.3371 1363.2083 1365.5730 1376.7816 1383.2439 1388.3484 1393.8809 1403.6136 1440.9420 1455.3087 1461.0817 1469.6941 1470.4175 1478.6691 1484.4745 1488.9523 1572.3336 1595.3219 1596.7576 1615.0434 2895.8161 2900.1898 2915.7613 2935.2139 2987.1284 3029.5864 3034.2294 3063.1391 3081.5959 3090.8933 3115.4611 3125.7712 3129.7334 3137.0828 3148.4711 3165.2744 3168.4640 3172.0692 3177.1305
redmass: 8.3824 7.1983 3.9168 2.9144 4.8472 3.1216 4.4653 4.8505 3.7105 3.9375 3.0122 6.7728 11.5535 3.2693 2.2971 2.3027 8.7569 4.4792 2.9911 2.3975 3.0560 3.3067 4.1877 7.5061 3.2965 3.4889 3.8665 4.2586 4.1844 4.0252 3.9231 6.2631 6.4848 5.6328 2.0603 2.3575 1.3667 1.5998 1.6171 1.7441 1.6659 2.6971 2.9843 1.2637 2.9004 1.4210 1.4445 1.3511 2.1320 2.2902 1.4000 5.8652 1.3358 4.9059 2.3034 2.4086 3.6597 2.4492 1.6911 1.9643 1.9411 1.9957 1.4958 1.8754 1.0585 1.1133 2.2092 2.3578 1.5257 1.3530 1.4244 1.2266 1.1785 1.3221 1.2886 1.2809 1.5297 1.5112 6.3893 2.7648 3.4858 1.2299 1.4474 2.0961 1.3691 1.8853 1.0574 1.0801 1.1925 1.6224 1.1758 7.9271 6.0941 6.7140 6.1426 1.0714 1.0707 1.0808 1.0696 1.0361 1.0874 1.0897 1.0940 1.0986 1.1008 1.0877 1.0859 1.0896 1.0910 1.0960 1.1012 1.0949 1.0645 1.0914
irintensity: 0.1256 0.0697 0.1638 0.0052 0.0646 0.6063 1.6607 0.3284 3.5922 0.4820 1.4508 0.2230 0.2433 0.2560 1.0732 1.6187 1.4146 1.6044 4.3041 6.4925 3.1337 0.5219 1.2914 2.5427 4.7008 8.2954 22.3117 11.4598 3.0564 7.4187 0.2942 0.4834 17.4962 8.8885 34.0573 52.4396 70.1384 62.3914 11.7459 16.9530 35.6464 12.8787 0.3728 1.7926 36.6149 16.0850 11.9633 2.7298 7.4838 7.8958 0.2668 0.4242 0.0981 35.6148 8.2282 37.0684 71.5141 11.9573 24.4956 2.1067 16.1999 30.4427 10.6076 29.2217 0.3845 0.2438 21.2289 2.0506 20.4737 18.7263 1.5034 7.0655 12.6257 7.4437 3.7748 4.8534 11.9237 3.0395 2.1963 47.0533 9.8994 23.8315 91.6743 10.5121 19.6302 47.0178 7.2354 1.7512 11.7148 17.2547 6.8753 11.2758 1.2643 4.0268 1.8610 22.7688 131.5088 45.9464 77.7968 24.7735 15.7500 15.4894 11.2498 51.5539 38.3771 7.9544 2.3846 9.5774 11.9630 37.8718 19.3266 5.4373 268.0112 4.0262
temp: 298.150 k
press: 1.00000 atm
elementType: 17 17 8 7 6 6 6 6 6 6 6 6 6 6 6 6 6 6 6 6 6 1 1 1 1 1 1 1 1 1 1 1 1 1 1 1 1 1 1 1
symmnumber: 1
zpe: 836108.6 jmol-1
zpe.correction: 0.318457 hartree
zpe.thermalcorrener: 0.339170 hartree
zpe.thermalcorrenthalpy: 0.340114 hartree
zpe.thermalcorrgfe: 0.265006 hartree
zpe.sumelectzpe: -1707.735885 hartree
zpe.sumelectthermal: -1707.715172 hartree
zpe.sumelectthermalent: -1707.714228 hartree
zpe.sumelectthermalfe: -1707.789336 hartree
dipole: 5.2522 -2.4354 -2.9512
dipole: 6.4982
quadrupole: -145.6185 -125.3644 -137.7732
quadrupole: -1.4019 1.5944 5.6990
quadrupole: -9.3665 10.8876 -1.5211 -1.4019 1.5944 5.6990
hfenergy: -1708.0543421 hartree
pointgroup: C01 [X(C17H19Cl2N1O1)]
dipole: 1.6428121 1.3437304 1.4253751 debye
polarizability: 212.9920973|30.5717047|236.8409227|-11.2784538|25.0674179|172.7538415 unknown
InChI: InChI=1S/C17H19Cl2NO/c1-2-20(11-13-6-4-3-5-7-13)12-17(21)14-8-9-15(18)16(19)10-14/h3-10,17,21H,2,11-12H2,1H3
charge 0 multiplicity 1
40 atoms
Cl -3.335293 -2.633557 -1.944827
Cl -5.701029 -1.711696 0.152527
O  0.137258 1.327049 -1.6889
N  1.766268 1.813477 0.352301
C  0.394912 1.378461 0.735636
C  -0.576455 1.659443 -0.464367
C  2.843979 1.027464 1.027777
C  1.963738 3.290107 0.47683
C  -1.852314 0.839793 -0.341833
C  2.869001 -0.44043 0.62086
C  3.105645 3.829545 -0.40358
C  -2.008586 -0.344825 -1.096388
C  -2.880229 1.237391 0.548348
C  2.808493 -1.460365 1.601626
C  2.978161 -0.810344 -0.744317
C  -3.17194 -1.12446 -0.951062
C  -4.043196 0.453175 0.696073
C  2.858684 -2.824493 1.230767
C  3.026064 -2.170002 -1.118993
C  -4.188984 -0.732112 -0.054896
C  2.966132 -3.182659 -0.131727
H  0.422227 0.289026 0.910043
H  0.023619 1.871226 1.66197
H  -0.849298 2.739256 -0.469808
H  2.755042 1.105102 2.137525
H  3.804752 1.499768 0.751868
H  1.020345 3.774402 0.16554
H  2.133256 3.573609 1.543261
H  4.091517 3.428095 -0.108825
H  2.930366 3.571595 -1.46282
H  3.159943 4.930246 -0.319404
H  -1.221761 -0.628573 -1.800113
H  -2.784706 2.165067 1.124833
H  1.107251 1.422308 -1.409836
H  2.720113 -1.186882 2.660712
H  3.026988 -0.028995 -1.511858
H  -4.841303 0.753416 1.381286
H  2.808186 -3.602482 2.000681
H  3.10738 -2.441896 -2.177316
H  2.999673 -4.238356 -0.423002
