program: Gaussian 09
title: 000237133
version: EM64L-G09RevD.01
frameworkgroup: C1[X(C13H25BrO)]
method: RPBEPBE
basis: SDD
operation: Freq
keyword: #p
keyword: freq=noraman
keyword: PBEPBE/SDD
title: #p freq=noraman PBEPBE/SDD
converged: YES YES NO NO
title: Mulliken charges:
elementType: Br O C C C C C C C C C C C C C H H H H H H H H H H H H H H H H H H H H H H H H H
charge: -0.015315 -0.192504 -0.384854 -0.384820 -0.381762 -0.385755 -0.372787 -0.374301 -0.353235 -0.374795 -0.356630 -0.517467 -0.696626 0.266812 -0.759481 0.194667 0.192852 0.194974 0.192070 0.191039 0.192844 0.194553 0.197767 0.190052 0.189128 0.193719 0.191329 0.188008 0.187146 0.225467 0.211532 0.194915 0.194730 0.267675 0.256975 0.209574 0.215133 0.209699 0.298162 0.309506
chargesum: 0.00000
title: Mulliken charges with hydrogens summed into heavy atoms:
elementType: Br O C C C C C C C C C C C C C
charge: -0.015315 -0.192504 0.002665 0.002224 0.002122 0.006566 0.006394 0.010747 0.021920 0.062204 0.033015 0.007183 -0.062220 0.266812 -0.151812
polarizability: 2.03503003e+02 -5.65396843e+00 1.58472641e+02 8.39516260e-01 1.81544349e+00 1.16729593e+02
1716.lowfreq: -3.5324 -0.0003 0.0004 0.0006 3.1732 8.5548 12.7820 16.9415 24.3653
frequency: 12.4175 16.8721 24.2799 34.6131 46.3989 60.3733 65.0599 84.1053 99.0966 100.2256 123.1783 132.5476 144.8063 152.3076 156.3140 183.2382 234.3493 239.4928 297.5200 322.1219 384.9620 401.5848 429.4970 476.1227 485.2663 571.7620 642.2695 712.7993 719.5741 722.8041 733.2495 755.6818 787.7292 827.7262 830.4735 871.0772 888.3419 919.9392 973.3568 981.5130 998.0030 1018.1231 1021.1135 1042.9049 1061.5124 1062.2532 1074.7452 1079.7038 1081.5534 1085.2511 1120.0005 1137.0016 1156.2561 1181.9472 1203.9001 1207.9279 1222.0047 1231.1913 1239.3885 1257.0504 1267.9399 1277.3134 1278.6140 1286.5113 1289.8479 1295.7685 1297.3260 1298.7233 1322.0708 1342.6847 1354.0046 1355.9940 1359.5780 1364.9749 1389.9899 1405.0212 1419.7001 1459.5491 1460.0360 1462.6678 1463.6269 1466.3134 1470.9257 1476.4385 1477.6664 1481.7139 1486.2263 1488.6318 1612.2535 2947.9929 2948.4782 2949.8127 2951.0788 2952.9228 2957.9993 2963.2158 2963.9038 2967.3638 2971.1626 2981.1266 2984.4516 2988.4998 2990.5707 2996.7056 3003.5095 3007.8621 3019.8919 3031.2597 3037.7588 3040.3994 3056.0381 3067.5701 3069.9632 3137.7818
redmass: 4.0679 3.3599 3.7078 2.1850 3.4464 4.1554 1.6978 2.8940 2.0347 3.1617 2.4454 1.7604 4.3800 2.1850 1.9512 4.3104 1.1127 4.0877 4.0735 4.3660 4.7280 3.0966 2.4149 3.1107 2.9945 3.6643 3.9688 1.1802 1.0598 1.0845 1.1376 1.2014 1.2493 3.2277 1.4763 1.3334 1.8980 1.2851 1.2340 4.8837 4.2545 3.7016 1.1352 3.4147 2.6879 1.1528 2.7234 2.1494 2.2279 2.2840 2.4415 2.2906 1.6443 1.8366 1.5218 1.3379 1.1905 1.3858 1.3435 1.2859 1.3453 1.1659 1.0325 1.0760 1.1085 1.2656 1.1180 1.1651 1.4298 1.5037 1.6535 1.6616 1.6510 1.7245 1.2182 1.0942 1.0908 1.0748 1.0743 1.0733 1.0654 1.0785 1.0837 1.0848 1.0424 1.0882 1.0916 1.0931 8.8224 1.0588 1.0588 1.0592 1.0593 1.0595 1.0593 1.0589 1.0617 1.0587 1.0365 1.0962 1.0968 1.0818 1.0798 1.0997 1.0952 1.1032 1.1046 1.1048 1.0595 1.1045 1.1028 1.1007 1.0993 1.1049
irintensity: 3.3849 0.9146 3.7117 0.1327 0.3719 1.1429 0.1145 0.4082 0.2520 0.8907 0.2353 0.0336 1.1120 0.2629 0.0034 1.1563 0.0022 3.7715 1.4907 0.4720 7.2104 0.7615 2.2106 1.2543 0.8903 2.9435 56.0507 8.3407 16.8843 0.5201 3.2393 0.6815 3.3376 1.8241 1.3834 5.2359 4.9677 0.3202 1.4219 1.8624 1.0988 2.8650 0.3797 1.3553 7.2753 3.1904 10.7756 0.3658 0.0905 3.6080 0.7075 29.0487 12.2855 0.6142 6.4783 29.9651 27.3773 1.1088 10.5115 1.3905 14.6839 0.4414 0.2134 0.4104 2.1642 9.9471 0.3327 1.8013 12.3642 13.5435 1.2678 3.3381 2.9133 17.3896 11.1982 22.5313 25.0874 0.0439 0.0697 0.2126 0.2317 1.1016 0.5996 3.0832 12.3517 1.8281 4.5102 35.8503 82.1575 0.1203 0.4244 0.4824 1.7487 2.9989 0.6258 78.1881 21.5085 192.6053 38.1069 0.1615 0.6230 16.0206 18.3123 2.2335 2.7714 0.1543 4.6622 0.3052 3.5594 198.0598 97.4162 98.5947 55.2703 0.8453
temp: 298.150 k
press: 1.00000 atm
elementType: 35 8 6 6 6 6 6 6 6 6 6 6 6 6 6 1 1 1 1 1 1 1 1 1 1 1 1 1 1 1 1 1 1 1 1 1 1 1 1 1
symmnumber: 1
zpe: 924272.6 jmol-1
zpe.correction: 0.352037 hartree
zpe.thermalcorrener: 0.372244 hartree
zpe.thermalcorrenthalpy: 0.373188 hartree
zpe.thermalcorrgfe: 0.296715 hartree
zpe.sumelectzpe: -597.822981 hartree
zpe.sumelectthermal: -597.802774 hartree
zpe.sumelectthermalent: -597.801830 hartree
zpe.sumelectthermalfe: -597.878303 hartree
dipole: -0.9834 -0.8367 0.9663
dipole: 1.6127
quadrupole: -111.4396 -114.6586 -102.2119
quadrupole: -1.2941 4.8907 1.9842
quadrupole: -2.0029 -5.2219 7.2248 -1.2941 4.8907 1.9842
hfenergy: -598.1750182 hartree
pointgroup: C01 [X(C13H25Br1O1)]
dipole: -0.4249028 -0.3471751 0.3186095 debye
polarizability: 201.4466689|-10.9883496|158.2628712|-0.9532945|9.838854|118.9956966 unknown
InChI: InChI=1S/C13H25BrO/c1-2-3-4-5-6-7-8-9-10-11-13(15)12-14/h2-12H2,1H3
charge 0 multiplicity 1
40 atoms
Br 6.819406 -2.50552 -0.529513
O  5.488713 1.381244 0.007807
C  -2.295195 0.390705 0.07075
C  -1.029544 -0.464748 -0.161417
C  -3.61092 -0.387911 -0.153361
C  0.285312 0.31932 0.047024
C  -4.876594 0.456957 0.115574
C  1.550351 -0.551884 -0.121345
C  -6.192917 -0.319634 -0.112519
C  2.858569 0.249424 0.055537
C  -7.458196 0.52218 0.170071
C  4.110527 -0.641999 -0.047354
C  -8.768764 -0.261692 -0.057968
C  5.41828 0.122865 0.036115
C  6.744653 -0.625812 0.228191
H  -2.271822 1.272544 -0.603529
H  -2.279451 0.79201 1.105898
H  -1.050207 -0.879867 -1.190913
H  -1.048784 -1.337479 0.525053
H  -3.622971 -1.282983 0.5038
H  -3.638578 -0.768815 -1.195888
H  0.285806 0.770281 1.061475
H  0.324899 1.166898 -0.668665
H  -4.863663 1.355228 -0.537103
H  -4.850008 0.832821 1.160079
H  1.538946 -1.025325 -1.125663
H  1.518671 -1.383321 0.614104
H  -6.225728 -0.688322 -1.159366
H  -6.203656 -1.22235 0.534127
H  2.917826 1.051143 -0.704834
H  2.854122 0.763024 1.037041
H  -7.447813 1.423394 -0.476843
H  -7.423553 0.891052 1.21572
H  4.11286 -1.204512 -1.005537
H  4.113885 -1.432871 0.731459
H  -8.820188 -1.148463 0.60195
H  -9.65721 0.363772 0.146972
H  -8.840112 -0.618321 -1.103016
H  6.947911 -0.747494 1.30672
H  7.564634 -0.068039 -0.24693
