program: Gaussian 09
title: 000237151
version: EM64L-G09RevD.01
frameworkgroup: C1[X(C21H24Br2O)]
method: RPBEPBE
basis: SDD
operation: Freq
keyword: #p
keyword: freq=noraman
keyword: PBEPBE/SDD
title: #p freq=noraman PBEPBE/SDD
converged: YES YES NO NO
title: Mulliken charges:
elementType: Br Br O C C C C C C C C C C C C C C C C C C C C C H H H H H H H H H H H H H H H H H H H H H H H H
charge: 0.035369 -0.027818 -0.193353 0.372320 -0.221890 0.586123 0.205024 -0.258898 -0.570401 -0.531678 -0.346277 0.176639 -0.699339 -0.718297 -0.631942 -0.689705 -0.691101 -0.659254 0.585393 -0.399368 -0.309709 -0.226056 -0.238976 -0.232945 0.257495 0.213663 0.232779 0.243363 0.251969 0.333392 0.203043 0.214598 0.255359 0.226881 0.223996 0.197702 0.214293 0.216109 0.228356 0.229593 0.215900 0.213741 0.355545 0.236240 0.226899 0.232200 0.229992 0.233029
chargesum: 0.00000
title: Mulliken charges with hydrogens summed into heavy atoms:
elementType: Br Br O C C C C C C C C C C C C C C C C C C C C C
charge: 0.035369 -0.027818 -0.193353 0.372320 0.035605 0.586123 0.205024 -0.045235 -0.337621 -0.288315 -0.094308 0.176639 -0.026338 -0.069718 -0.298550 -0.030946 -0.031867 -0.303710 0.585393 -0.163127 -0.082810 0.006144 -0.008984 0.000083
polarizability: 3.65822785e+02 -1.70848449e+01 2.54938171e+02 2.35698438e+01 1.48684216e+01 2.13018295e+02
1716.lowfreq: -4.4230 -3.2232 -0.0005 0.0004 0.0005 5.6364 13.5599 19.3382 24.8718
frequency: 13.1650 19.2004 24.8598 35.9885 40.6121 56.4094 62.4001 71.1506 87.1193 104.2373 110.4331 118.9231 136.6353 162.3009 167.6523 176.0670 191.5261 208.0663 215.4436 226.6204 237.4739 249.3022 261.8194 270.9052 305.1857 321.4224 338.6212 347.2098 396.5893 401.9415 437.5411 459.6429 475.8710 491.2974 525.2190 548.7228 556.7265 563.5556 595.8620 616.0299 621.3238 652.6391 687.9089 697.9520 713.6183 754.4080 779.4549 786.5743 831.2650 842.3953 848.2032 857.8851 884.2669 914.8614 919.1946 919.8990 921.6344 927.5748 955.8163 960.0305 964.3704 970.5415 978.0914 990.9696 999.5543 1026.4729 1055.5295 1066.4728 1082.8528 1096.9806 1105.0094 1109.6070 1117.5820 1140.7150 1148.4607 1160.8171 1174.7833 1176.1512 1190.4203 1194.6201 1211.0388 1229.6408 1238.6982 1265.8764 1278.3715 1287.6514 1308.4311 1319.6387 1329.9572 1340.5008 1368.9990 1372.6735 1378.5565 1388.5671 1390.5096 1394.6852 1397.0164 1418.1605 1445.3770 1461.5666 1466.7564 1467.9375 1469.2041 1478.2157 1481.3848 1485.3352 1487.4769 1487.8655 1494.4732 1551.1443 1582.3181 1593.2274 1611.4272 1615.4490 2974.1099 2976.6206 2977.4952 2979.7764 2983.8125 3030.9080 3064.6841 3071.5032 3074.9202 3077.5813 3078.1320 3079.4100 3083.5466 3094.7601 3096.1155 3122.2108 3125.4902 3125.7016 3128.6518 3139.4032 3140.1124 3149.0373 3152.1589 3167.8695
redmass: 5.1532 5.3319 5.7374 5.0789 3.2216 3.3994 4.2859 5.0011 6.4760 4.0943 5.3457 6.7617 3.3510 4.9882 9.4214 4.3342 4.1961 1.1315 1.1679 5.4010 1.0736 1.0818 4.0591 3.7167 2.8603 3.5649 3.5605 3.5936 3.4419 2.7817 4.0962 3.4318 3.1523 3.8107 4.8323 3.4446 4.5673 4.6038 4.4526 5.7394 4.2611 4.2254 4.7589 1.6566 4.1669 4.9373 1.9956 3.6626 3.1743 1.5867 1.2604 4.1632 2.5840 1.7452 1.5028 1.2275 1.4260 1.5116 1.4396 1.4369 2.2977 2.0094 1.4000 6.1349 1.3343 2.3182 1.5833 2.2960 1.9928 1.8572 2.0213 2.6070 2.1325 1.8829 1.1902 1.4231 1.0900 1.4957 1.2953 1.4710 1.4499 1.8238 2.0964 2.5030 1.4447 1.3173 1.3148 1.4867 2.2414 1.8055 1.7066 1.2325 1.1913 2.3963 3.9740 1.2881 1.2193 2.3393 2.1682 1.0611 1.0449 1.0590 1.0580 1.1049 1.2773 2.3118 1.0697 1.0572 1.5775 6.1585 8.4790 6.1107 6.0143 5.8882 1.0354 1.0359 1.0348 1.0354 1.0843 1.0845 1.0995 1.1000 1.0978 1.1001 1.0993 1.1005 1.0998 1.0866 1.0993 1.0873 1.0868 1.0866 1.0874 1.0893 1.0917 1.0959 1.0964 1.1016
irintensity: 0.6182 0.1073 0.3558 0.0788 0.0157 0.0872 0.1899 0.0923 0.9161 1.5550 2.2137 0.4956 0.3196 0.2161 4.5885 0.6950 3.3983 0.1731 0.1333 4.1885 0.1059 0.2551 0.4036 1.8781 0.2382 1.7226 0.8930 4.0062 2.8722 0.5044 15.9205 12.2339 6.2929 29.3803 63.3988 21.9642 54.6362 6.7868 15.5906 0.2081 6.4034 6.3990 10.0209 54.9104 2.3616 19.5339 26.4439 1.3008 3.3357 24.4369 0.4065 3.7530 5.0077 5.5632 6.3931 9.4751 2.9646 2.3261 0.3519 1.1128 30.8872 15.4330 0.3185 0.1805 0.1547 5.1105 43.2711 7.0608 18.2194 1.8114 17.8618 0.9098 3.4521 6.2440 40.9804 10.0668 0.1046 5.4513 5.5543 12.4406 8.9433 21.3161 109.9222 74.7366 8.8330 2.7054 0.4002 15.5384 1.4936 16.0241 18.0802 21.3630 16.0268 1.6678 4.9253 14.8588 3.1054 16.4822 6.4884 3.7297 4.0218 5.5323 1.0209 9.9380 34.6813 1.8198 14.2101 3.5934 17.9515 111.4489 128.1843 4.7351 2.6657 98.6928 24.0524 36.9468 30.4442 40.5937 18.3855 2.5971 3.0345 1.0600 79.6196 62.3211 59.7824 28.6595 37.1183 3.8634 21.8914 4.7992 8.6978 3.6211 1.2783 23.1733 11.3020 8.8996 33.6269 23.9077
temp: 298.150 k
press: 1.00000 atm
elementType: 35 35 8 6 6 6 6 6 6 6 6 6 6 6 6 6 6 6 6 6 6 6 6 6 1 1 1 1 1 1 1 1 1 1 1 1 1 1 1 1 1 1 1 1 1 1 1 1
symmnumber: 1
zpe: 1021902.7 jmol-1
zpe.correction: 0.389222 hartree
zpe.thermalcorrener: 0.414995 hartree
zpe.thermalcorrenthalpy: 0.415940 hartree
zpe.thermalcorrgfe: 0.329198 hartree
zpe.sumelectzpe: -915.023384 hartree
zpe.sumelectthermal: -914.997610 hartree
zpe.sumelectthermalent: -914.996666 hartree
zpe.sumelectthermalfe: -915.083408 hartree
dipole: -1.2748 -1.7919 -2.3430
dipole: 3.2133
quadrupole: -130.3364 -162.6029 -165.9350
quadrupole: -0.4079 2.6037 9.0368
quadrupole: 22.6217 -9.6448 -12.9769 -0.4079 2.6037 9.0368
hfenergy: -915.4126059 hartree
pointgroup: C01 [X(C21H24Br2O1)]
dipole: -0.5856737 0.9882117 0.5278818 debye
polarizability: 359.4464718|15.4579363|260.4824517|-36.9917747|-12.9239946|213.8503276 unknown
InChI: InChI=1S/C21H24Br2O/c1-13(2)16-10-11-17(18(12-16)14(3)4)21(24)20(23)19(22)15-8-6-5-7-9-15/h5-14,19-20H,1-4H3
charge 0 multiplicity 1
48 atoms
Br 1.784614 1.323262 -2.163853
Br 2.214272 -1.204964 1.89819
O  0.508973 -1.719669 -1.179645
C  -2.135193 -1.124103 0.14851
C  -1.906827 -2.64069 0.170448
C  -3.717396 0.770399 0.499066
C  -1.111923 -0.178501 -0.216257
C  -5.11304 1.270854 0.874873
C  -3.406275 -0.611339 0.502965
C  -2.693906 1.682917 0.1395
C  -1.413894 1.214447 -0.197804
C  0.253155 -0.606673 -0.633781
C  -2.348089 -3.260866 -1.186542
C  -2.611827 -3.352219 1.352576
C  1.438627 0.362299 -0.368628
C  -5.46767 0.919511 2.345358
C  -6.194754 0.729257 -0.09853
C  2.711237 -0.38351 0.021167
C  3.991812 0.387076 0.15774
C  5.191328 -0.19258 -0.329207
C  4.042313 1.66969 0.764693
C  6.417464 0.499173 -0.223469
C  5.265958 2.359957 0.87281
C  6.45802 1.777655 0.378042
H  -0.823351 -2.82803 0.265115
H  -5.105969 2.375878 0.786816
H  -4.186325 -1.32239 0.795967
H  -2.905388 2.758443 0.121087
H  -0.652135 1.939974 -0.502689
H  1.192578 1.177181 0.325222
H  -3.426859 -3.091359 -1.365855
H  -2.165914 -4.351482 -1.181513
H  -1.775274 -2.821689 -2.020271
H  -2.359216 -2.881449 2.320248
H  -2.286574 -4.408047 1.390469
H  -3.712835 -3.35694 1.246218
H  -5.50678 -0.175358 2.495051
H  -6.458358 1.332447 2.610783
H  -4.720807 1.33082 3.047848
H  -5.968136 1.005351 -1.143899
H  -7.187367 1.14068 0.161994
H  -6.262309 -0.373168 -0.046135
H  2.810769 -1.290075 -0.595614
H  5.159577 -1.184323 -0.796114
H  3.128544 2.12463 1.163997
H  7.336024 0.043101 -0.608131
H  5.294613 3.349013 1.342822
H  7.408611 2.315708 0.462963
