program: Gaussian 09
title: 000237280
version: EM64L-G09RevD.01
frameworkgroup: C1[X(C29H23NO2)]
method: RPBEPBE
basis: SDD
operation: Freq
keyword: #p
keyword: freq=noraman
keyword: PBEPBE/SDD
title: #p freq=noraman PBEPBE/SDD
converged: YES YES NO NO
title: Mulliken charges:
elementType: O O N C C C C C C C C C C C C C C C C C C C C C C C C C C C C C H H H H H H H H H H H H H H H H H H H H H H H
charge: -0.220861 -0.263294 -0.250613 0.425082 0.297388 0.367556 -0.391681 -0.386903 -0.393523 -0.395598 0.336124 -0.670573 0.007686 -0.495993 0.397214 -0.387897 -0.392848 0.145356 0.304680 -0.326987 -0.379543 -0.236724 -0.236100 -0.240219 -0.243145 -0.227512 -0.355482 -0.367852 -0.234339 -0.250032 -0.235930 -0.233656 0.240071 0.294775 0.240429 0.244236 0.241846 0.255958 0.246166 0.237025 0.241929 0.235495 0.232578 0.272374 0.227523 0.226064 0.230849 0.225499 0.228818 0.219983 0.280171 0.228928 0.225917 0.229813 0.229768
chargesum: 0.00000
title: Mulliken charges with hydrogens summed into heavy atoms:
elementType: O O N C C C C C C C C C C C C C C C C C C C C C C C C C C C C C
charge: -0.220861 -0.263294 -0.250613 0.425082 0.297388 0.367556 -0.151610 -0.092128 -0.153093 -0.151362 0.336124 0.073398 0.007686 -0.258968 0.397214 -0.145968 -0.157353 0.145356 0.304680 -0.094409 -0.107169 -0.009200 -0.010036 -0.009370 -0.017646 0.001306 -0.135499 -0.087680 -0.005410 -0.024115 -0.006117 -0.003888
polarizability: 5.95999334e+02 3.24297024e+01 2.79518730e+02 -9.95896024e-01 -2.15901740e+01 2.46384844e+02
1716.lowfreq: -3.1937 -2.7598 -0.0009 0.0001 0.0007 4.9573 10.1387 15.7381 21.6464
frequency: 10.0710 15.6283 21.5952 28.2105 32.3535 37.8517 56.9170 59.9616 80.2685 86.1253 107.2641 118.8946 123.8119 150.2593 168.3436 176.9781 185.7473 201.5540 212.2366 234.2903 266.3584 283.1715 285.2225 307.9186 348.8296 372.5731 399.7578 400.0183 401.5066 405.9483 415.6304 427.1744 438.5865 445.1145 462.3739 483.9148 505.3939 520.0460 576.1554 610.1746 613.6708 614.3344 614.3531 637.2157 650.2732 657.6844 676.7893 687.2174 691.8254 697.3246 701.5959 706.1756 735.7319 738.9919 771.2926 778.8786 784.8784 790.6367 820.8377 836.9180 849.7565 850.7220 856.5541 856.5933 877.8702 920.1801 937.2770 940.0801 945.8325 955.5928 971.9389 973.8869 985.8131 985.9678 988.5138 989.9331 990.3747 994.3917 995.3415 1003.9145 1007.9295 1013.5893 1023.3044 1024.2809 1039.2201 1050.6505 1067.6253 1082.1377 1085.2727 1089.5492 1106.4108 1126.0237 1129.1373 1171.5604 1171.8480 1173.9819 1181.4116 1188.3157 1191.0693 1203.6545 1221.7025 1227.2631 1269.7042 1291.6936 1305.4858 1311.8738 1314.7292 1315.9783 1350.4043 1374.1618 1379.0407 1384.5790 1388.9856 1389.3575 1418.1602 1427.0220 1435.6067 1437.6626 1440.3177 1472.0123 1473.6550 1478.3251 1479.0425 1484.4686 1494.3586 1516.8731 1544.9350 1557.7125 1565.0671 1587.6633 1591.4330 1593.6995 1609.5732 1610.0900 1612.3215 1618.1011 2966.7342 3042.6876 3122.6391 3123.5149 3124.7260 3125.1762 3127.5061 3129.9639 3131.3028 3134.8038 3140.0943 3142.9331 3143.1737 3147.3262 3149.8294 3152.8548 3155.2287 3156.9578 3165.8534 3166.3673 3167.3527 3175.4467 3177.4806
redmass: 5.5494 5.6637 4.2182 4.1340 4.3106 4.2968 4.9540 5.7504 3.9820 4.3240 5.3424 4.7017 4.5375 6.5537 4.8777 4.0682 3.5483 4.1175 3.8165 2.0391 3.6831 5.5912 4.6467 7.6111 4.8700 4.1306 3.1165 2.8399 4.4264 2.9264 3.0811 4.9200 4.9632 4.8888 4.3841 4.1565 4.2347 4.5867 2.6287 6.0169 6.4474 6.3936 6.4183 6.8588 6.7849 5.0550 6.0187 3.1346 2.0322 1.6065 1.7442 3.3232 3.7135 3.7991 1.9733 2.7701 2.0023 2.5783 2.3318 1.3169 1.2552 1.5245 1.2537 1.2555 5.0432 1.4393 1.8215 1.4453 3.1274 1.3600 1.3845 1.4397 1.4114 1.4694 4.9494 5.5605 4.8232 1.3221 6.0391 1.3457 1.3436 3.2362 2.3201 2.2671 2.0939 3.1037 2.0985 1.5674 1.6257 1.8502 1.3151 1.4156 1.6233 1.0651 1.0615 1.0530 1.1317 1.1257 1.1147 1.1664 2.1621 3.7123 3.3605 3.2815 1.3823 1.4152 1.3483 1.3835 2.8967 6.3128 3.1537 7.7046 3.8078 5.8761 3.6060 2.3798 2.2028 1.8151 1.6964 1.0656 2.3571 2.2914 2.5135 2.0445 1.5567 2.8001 10.1909 6.2369 6.3427 6.4364 6.2472 6.5690 6.0703 6.0509 5.9914 6.2631 1.0371 1.1012 1.0849 1.0847 1.0848 1.0965 1.0877 1.0878 1.0881 1.0880 1.0913 1.0908 1.0923 1.0927 1.0961 1.0961 1.0959 1.0958 1.1016 1.1007 1.1004 1.0960 1.0895
irintensity: 0.0455 0.0939 0.3387 0.1290 0.6411 1.4336 2.3717 1.0313 2.2929 0.5040 0.0197 2.0127 0.9609 2.6507 4.6926 0.3735 1.7969 3.6460 4.1047 0.4613 1.1291 17.7872 3.1067 32.3783 1.8939 2.1904 0.3913 0.1159 1.1235 0.5627 1.1951 1.1967 0.4037 6.3806 3.0760 0.4533 23.2691 9.3247 30.4994 12.5037 0.1897 0.1187 1.3994 1.1194 16.6483 14.7353 11.9006 10.8653 20.4149 55.3945 45.9199 81.3126 21.4105 17.3648 67.5476 30.2212 41.5942 14.7635 12.6792 7.2020 1.4782 37.5814 0.6642 1.1777 100.1515 1.4852 7.6064 0.9894 26.8717 0.9931 5.2616 0.2381 0.7358 0.3404 0.3068 2.0127 0.8807 0.1466 21.1699 0.0921 1.7070 7.8034 14.5431 4.2295 4.8562 15.8224 29.1706 8.8801 8.9668 10.4540 10.4737 9.5485 62.0843 5.8035 5.1378 0.0223 26.8030 40.4182 0.3979 16.9418 206.1506 116.4105 154.1558 5.4238 2.5869 4.6464 3.9899 2.3758 23.7643 2.6586 69.5228 16.1439 11.2013 7.3303 10.3255 25.8939 22.3407 12.9308 8.3607 14.0138 330.0816 7.9189 46.5195 272.1788 30.4884 64.4752 135.9798 846.7870 71.6994 1.8420 39.1099 12.9998 3.7108 8.2772 2.8873 3.1465 40.0287 20.3831 1.3477 14.0243 1.3834 16.0886 0.6785 9.5759 4.2480 8.3595 22.8949 5.8336 19.0534 28.5307 31.0824 13.8179 19.6345 16.7694 31.9806 28.4518 34.2677 0.1337 16.8495
temp: 298.150 k
press: 1.00000 atm
elementType: 8 8 7 6 6 6 6 6 6 6 6 6 6 6 6 6 6 6 6 6 6 6 6 6 6 6 6 6 6 6 6 6 1 1 1 1 1 1 1 1 1 1 1 1 1 1 1 1 1 1 1 1 1 1 1
symmnumber: 1
zpe: 1134726.0 jmol-1
zpe.correction: 0.432194 hartree
zpe.thermalcorrener: 0.459659 hartree
zpe.thermalcorrenthalpy: 0.460603 hartree
zpe.thermalcorrgfe: 0.369875 hartree
zpe.sumelectzpe: -1321.880888 hartree
zpe.sumelectthermal: -1321.853423 hartree
zpe.sumelectthermalent: -1321.852479 hartree
zpe.sumelectthermalfe: -1321.943207 hartree
dipole: 2.0739 -2.6816 4.5764
dipole: 5.6952
quadrupole: -159.7334 -170.5633 -180.6853
quadrupole: 11.1912 -7.0825 -5.6636
quadrupole: 10.5940 -0.2360 -10.3580 11.1912 -7.0825 -5.6636
hfenergy: -1322.313082 hartree
pointgroup: C01 [X(C29H23N1O2)]
dipole: -0.8632427 -0.7998087 -1.9067502 debye
polarizability: 592.5716197|-45.6953174|277.3810163|-5.865657|25.3358991|251.9502716 unknown
InChI: InChI=1S/C29H23NO2/c1-30(26-19-17-23(18-20-26)22-11-5-2-6-12-22)27(29(32)25-15-9-4-10-16-25)21-28(31)24-13-7-3-8-14-24/h2-21H,1H3
charge 0 multiplicity 1
55 atoms
O  0.730228 0.138544 1.990872
O  3.438492 0.787223 0.861586
N  0.294053 -1.405632 -0.804269
C  -1.104782 -1.118729 -0.554431
C  1.342218 -0.754515 -0.171896
C  -3.895582 -0.652875 -0.137701
C  -1.948421 -0.785732 -1.644305
C  -1.659696 -1.228121 0.744279
C  -3.321041 -0.558213 -1.436209
C  -3.033967 -0.991051 0.941404
C  -5.348739 -0.406408 0.083584
C  0.600085 -2.490817 -1.763366
C  0.973961 0.404824 0.776475
C  2.674593 -1.115669 -0.354541
C  0.727988 1.752811 0.177897
C  -5.816029 0.160501 1.302124
C  -6.308261 -0.731033 -0.915554
C  3.726006 -0.307561 0.245142
C  5.166076 -0.733854 0.135183
C  0.986119 2.026023 -1.190085
C  0.209372 2.779135 1.010099
C  -7.191418 0.392142 1.51488
C  -7.683839 -0.497568 -0.705224
C  -8.133585 0.064765 0.512109
C  0.728544 3.307556 -1.719192
C  -0.049395 4.058431 0.480849
C  5.569897 -2.014094 -0.331138
C  6.163801 0.194465 0.537574
C  0.208618 4.326335 -0.886002
C  6.938534 -2.353509 -0.398539
C  7.530134 -0.141941 0.466675
C  7.923327 -1.418068 -0.004011
H  -1.52028 -0.672072 -2.64672
H  -1.018903 -1.499416 1.587333
H  -3.946551 -0.25981 -2.284534
H  -3.448489 -1.109776 1.948183
H  1.269995 -2.131327 -2.567052
H  -0.33766 -2.853576 -2.207383
H  1.093104 -3.338426 -1.248745
H  2.939296 -1.987559 -0.955069
H  -5.095237 0.45132 2.074652
H  -5.979121 -1.198727 -1.850564
H  1.408464 1.243075 -1.830796
H  0.024071 2.546923 2.064073
H  -7.527035 0.837381 2.458163
H  -8.40546 -0.763595 -1.485806
H  -9.201569 0.245282 0.676624
H  0.936933 3.517312 -2.774259
H  -0.448401 4.8483 1.126874
H  4.824233 -2.761074 -0.622925
H  5.833112 1.17086 0.906778
H  0.00893 5.322493 -1.297239
H  7.237265 -3.346444 -0.752943
H  8.288859 0.584705 0.777726
H  8.985454 -1.682612 -0.05804
