program: Gaussian 09
title: 000237099
version: EM64L-G09RevD.01
frameworkgroup: C1[X(C10H8ClN3O)]
method: RPBEPBE
basis: SDD
operation: Freq
keyword: #p
keyword: freq=noraman
keyword: PBEPBE/SDD
title: #p freq=noraman PBEPBE/SDD
converged: NO YES NO NO
title: Mulliken charges:
elementType: Cl O N N N C C C C C C C C C C H H H H H H H H
charge: -0.067629 -0.254831 -0.230085 -0.474216 -0.082642 0.596730 0.315095 -0.353239 -0.309188 -0.173004 -0.150359 -0.217320 -0.219093 -0.237512 -0.307144 0.323044 0.311009 0.245109 0.288643 0.258755 0.237362 0.240277 0.260239
chargesum: 0.00000
title: Mulliken charges with hydrogens summed into heavy atoms:
elementType: Cl O N N N C C C C C C C C C C
charge: -0.067629 -0.254831 -0.230085 -0.151173 -0.082642 0.596730 0.315095 -0.353239 0.001821 0.072105 0.138284 0.041435 0.018270 0.002765 -0.046905
polarizability: 2.18519781e+02 1.11804037e+01 1.54357467e+02 -4.47992515e-03 -1.11272815e-03 5.38473423e+01
1716.lowfreq: -22.7614 -7.3209 0.0020 0.0022 0.0027 2.6547 8.2494 45.6136 74.4285
frequency: -22.7402 45.6090 74.4218 81.6854 146.4598 187.8423 202.7779 224.0771 279.3002 320.6868 376.3361 413.4240 438.4930 505.9924 531.8194 587.2994 591.6127 632.4539 652.9114 666.6182 700.8772 712.3032 730.6945 764.3817 813.1369 819.9491 851.8719 853.6883 873.0744 874.8427 953.6731 979.4465 997.2166 1006.5500 1037.9241 1049.7114 1105.6853 1124.6436 1143.1836 1174.8432 1207.4105 1239.5293 1252.6702 1265.6666 1311.1409 1342.9831 1376.5117 1430.9087 1441.0213 1460.8195 1484.3388 1527.1177 1583.9988 1614.7937 1649.2348 3146.8296 3162.7974 3179.4611 3193.4197 3223.6893 3250.2337 3265.0055 3490.3214
redmass: 3.8083 8.0673 5.5962 7.8912 5.1379 6.4333 8.9274 7.2241 4.4650 9.0386 8.0241 8.6202 3.3418 7.1681 3.1050 7.0134 2.6852 2.2262 2.0481 7.2636 1.8312 4.6543 2.2464 1.2652 6.8189 1.4008 6.6947 1.4249 6.2975 1.3460 1.3568 4.6430 1.3157 7.1405 2.1424 2.1310 1.7809 1.7705 2.0298 1.0687 1.9127 2.4875 1.7954 2.5908 1.8801 3.7178 7.6301 2.5546 3.4853 2.5503 4.3410 2.2943 4.4391 6.2473 7.7617 1.0868 1.0920 1.0980 1.0959 1.0911 1.1060 1.1022 1.0757
irintensity: 0.9365 0.2379 4.0935 1.4090 2.4121 3.7624 5.3382 3.5862 3.4000 6.5523 8.6105 1.1528 12.0214 1.2591 4.4002 13.3057 1.5973 15.0476 4.2781 18.7572 24.5581 34.5621 46.4501 136.0901 17.5116 51.1559 18.2095 0.8734 4.3865 4.7223 5.8008 63.7077 2.5709 38.4052 23.7086 19.0068 33.0998 2.8804 1.8624 0.2907 229.9421 32.8340 22.7733 296.4719 65.6129 12.2834 171.1138 109.4970 71.8248 10.6043 0.8462 559.8587 55.2972 110.8838 184.5580 3.3195 9.6944 6.5621 10.4503 1.3962 1.1928 5.5397 48.4052
temp: 298.150 k
press: 1.00000 atm
elementType: 17 8 7 7 7 6 6 6 6 6 6 6 6 6 6 1 1 1 1 1 1 1 1
symmnumber: 1
zpe: 434408.4 jmol-1
zpe.correction: 0.165457 hartree
zpe.thermalcorrener: 0.177134 hartree
zpe.thermalcorrenthalpy: 0.178078 hartree
zpe.thermalcorrgfe: 0.126383 hartree
zpe.sumelectzpe: -1084.352472 hartree
zpe.sumelectthermal: -1084.340795 hartree
zpe.sumelectthermalent: -1084.339851 hartree
zpe.sumelectthermalfe: -1084.391547 hartree
dipole: -4.5182 1.7976 -0.0005
dipole: 4.8627
quadrupole: -100.2081 -90.4558 -98.1034
quadrupole: 9.1587 -0.0037 0.0002
quadrupole: -3.9523 5.7999 -1.8476 9.1587 -0.0037 0.0002
hfenergy: -1084.5179298 hartree
pointgroup: C01 [X(C10H8Cl1N3O1)]
dipole: -1.7516688 -0.7691997 0.0003009 debye
dipolederiv: -0.256585 0.2068225 -0.0000744 0.1429194 -0.6521401 0.0001522 -0.0000647 0.0001545 -0.0557639 -0.7749024 0.0745612 0.0000029 -0.1668458 -0.9652985 -0.0000952 0.0002112 0.0003467 -0.3480316 -1.9148031 0.3951984 0.0000233 0.5647705 -0.3243053 0.000045 0.0004306 -0.0000167 -0.0301188 -1.9984857 -0.1876567 -0.0000217 -0.687017 -0.5039556 0.0000545 0.0000757 0.0000447 -0.2943179 -0.6714582 0.0944799 0.0000203 0.4697574 -0.3657446 -0.0000161 -0.0000976 0.000014 -0.2566346 1.2257571 0.1051119 0.0001279 -0.235343 -0.1761264 0.0000307 0.000239 0.0000578 0.1080664 2.8958083 -0.1379694 -0.0000487 0.4206858 1.3965879 0.0000002 -0.0006196 -0.0003471 0.3430585 -0.0067282 -0.3054202 0.0001023 -0.3015479 0.903484 -0.0002711 0.0000271 -0.0002484 -0.106786 -0.2329026 -0.0769398 0.0000272 0.1864735 -0.0519959 0.0000159 -0.0000408 -0.0000405 -0.1479977 0.1981875 -0.1568938 -0.0000104 -0.5452122 0.0396146 0.0000384 0.000072 -0.0000335 -0.1928695 1.0892908 -0.0829437 -0.0001167 0.2248785 0.0343509 -0.0000518 -0.0001722 0.0000484 -0.0557352 -0.0411839 0.0517009 -0.0000005 0.151745 -0.1219893 0.0000351 -0.000013 0.0000203 -0.0821936 0.0407171 -0.0126123 0.0000342 -0.1012052 0.1454506 -0.0000693 0.0000692 -0.0000638 -0.141249 -0.0246279 0.0031852 0.0000427 -0.0425819 -0.0594392 -0.000028 0.0000379 -0.0000182 -0.1710916 -0.224908 -0.0164848 -0.0000076 -0.2190155 0.2658697 -0.0000629 0.0000775 -0.0000934 -0.1578598 0.3019964 0.0365913 -0.0000419 0.1370332 0.2047038 0.0000328 -0.0001009 0.000012 0.2927892 0.165514 -0.0380417 -0.0000123 -0.0344535 0.0729405 0.0000171 -0.0000249 0.0000194 0.1825511 0.0242504 -0.1001783 0.0000511 -0.0705947 0.06719 0.0000191 0.0000329 0.0000373 0.2294822 0.1353383 0.0348799 0.000006 0.0218181 0.0728112 0.0000306 -0.0000227 -0.0000241 0.194171 0.0578438 -0.0545669 -0.0000092 -0.0775845 0.0060983 0.000017 0.0000009 0.0000168 0.1670722 0.0520733 0.0564868 -0.0000294 0.083286 -0.0672008 0.0000575 -0.0000373 0.0000555 0.1596476 -0.1004359 0.0290393 -0.0000576 0.0257377 0.0746869 0.0000233 -0.0000644 0.0000244 0.1693429 0.0602439 0.0816504 -0.0000073 0.0522962 0.0044072 0.000025 -0.0000157 0.0000339 0.194468 unknown
polarizability: 219.2252045|-8.9018045|153.6520381|0.0125556|-0.0213505|53.8473474 unknown
InChI: InChI=1S/C10H8ClN3O/c11-8-3-1-2-4-9(8)13-10(15)14-6-5-12-7-14/h1-7,13H
charge 0 multiplicity 1
23 atoms
Cl -1.652428 -2.719018 0.000609
O  0.869521 1.990509 -0.000224
N  2.300151 0.130789 0.000253
N  -0.042626 -0.18337 0.000458
N  4.57412 0.112297 -0.000071
C  -1.434682 0.088931 0.000121
C  0.99135 0.738177 0.000422
C  -2.336302 -1.010621 0.000152
C  -1.989083 1.397745 -0.000244
C  2.695917 -1.228886 0.000322
C  3.486467 0.8920 -0.000228
C  -3.728437 -0.846294 -0.00016
C  -3.388295 1.572565 -0.000559
C  -4.262692 0.462919 -0.000521
C  4.08473 -1.214455 0.000198
H  0.189752 -1.181135 0.00069
H  -1.309308 2.251714 -0.000269
H  2.002818 -2.066074 0.000528
H  3.460295 1.977529 -0.000436
H  -4.381435 -1.723497 -0.000121
H  -3.794657 2.589109 -0.000838
H  -5.347732 0.604008 -0.000769
H  4.764454 -2.063142 0.000288
