program: Gaussian 09
title: 000237174
version: EM64L-G09RevD.01
frameworkgroup: C1[X(C26H20Cl2)]
method: RPBEPBE
basis: SDD
operation: Freq
keyword: #p
keyword: freq=noraman
keyword: PBEPBE/SDD
title: #p freq=noraman PBEPBE/SDD
converged: YES YES NO NO
title: Mulliken charges:
elementType: Cl Cl C C C C C C C C C C C C C C C C C C C C C C C C C C H H H H H H H H H H H H H H H H H H H H
charge: -0.051612 -0.050235 -0.418551 -0.420912 0.452688 0.477897 0.455901 0.477493 -0.328657 -0.366571 -0.329729 -0.365497 -0.379027 -0.375667 -0.381025 -0.378719 -0.249721 -0.245531 -0.248973 -0.245920 -0.266797 -0.240224 -0.266242 -0.239135 -0.242217 -0.244704 -0.242183 -0.244683 0.269663 0.270525 0.269087 0.270723 0.287590 0.279191 0.287798 0.278232 0.228489 0.227639 0.228424 0.227797 0.230770 0.226800 0.230772 0.226611 0.230341 0.228881 0.230353 0.228865
chargesum: 0.00000
title: Mulliken charges with hydrogens summed into heavy atoms:
elementType: Cl Cl C C C C C C C C C C C C C C C C C C C C C C C C C C
charge: -0.051612 -0.050235 -0.418551 -0.420912 0.452688 0.477897 0.455901 0.477493 -0.058994 -0.096046 -0.060642 -0.094774 -0.091437 -0.096477 -0.093227 -0.100487 -0.021232 -0.017892 -0.020549 -0.018123 -0.036027 -0.013424 -0.035470 -0.012524 -0.011876 -0.015823 -0.011829 -0.015818
polarizability: 3.46384962e+02 1.12925477e+00 3.03448919e+02 -3.91861269e-01 1.75031337e+01 2.25308424e+02
1716.lowfreq: -4.7653 -0.0021 -0.0019 0.0005 4.0632 11.3897 29.3742 53.5993 55.7357
frequency: 29.3695 53.5975 55.7290 62.9276 68.2113 77.9347 81.9435 83.2066 103.3636 135.9288 150.7017 182.1344 196.0101 208.4073 210.3497 242.5451 251.5017 263.4868 271.6876 276.1036 288.4202 299.1610 308.1721 316.1676 402.5797 407.0712 408.7138 413.3445 472.6461 484.8880 488.5635 518.8324 581.8581 610.3314 615.3097 615.5152 617.3126 622.7856 634.9156 655.4010 659.0407 701.3163 703.1167 703.5269 709.0843 727.1760 749.7447 766.6454 775.1924 801.8881 826.2293 840.8090 851.6724 853.2730 854.2216 857.9990 923.0968 927.3971 936.7629 937.3883 952.3735 980.1673 981.2276 981.8531 983.0263 988.4929 990.4818 990.7026 991.6675 993.7202 997.2223 997.6182 998.1359 1001.1786 1030.6875 1032.4277 1035.3149 1039.3625 1090.6018 1091.3930 1094.3479 1096.1405 1163.5122 1173.0414 1173.4737 1174.3998 1175.5911 1176.1679 1198.2456 1200.1557 1201.4581 1204.2105 1207.1825 1214.1647 1321.0943 1322.4360 1330.2002 1331.9557 1374.1419 1374.7090 1378.8935 1379.8259 1429.5821 1430.2904 1434.7136 1434.8560 1475.8059 1477.7708 1482.9121 1483.1466 1583.7850 1585.1328 1586.8225 1588.0184 1604.7384 1605.0241 1607.2387 1608.0010 3125.7664 3125.9353 3127.2559 3127.4907 3138.2351 3138.3043 3138.5025 3138.6109 3151.6523 3152.0321 3154.3241 3154.7350 3164.7510 3165.0777 3168.2875 3169.0118 3176.9100 3177.6897 3193.5320 3194.6676
redmass: 5.7262 4.8331 5.2132 3.7653 5.2297 4.4351 4.5979 4.8439 3.8081 7.8051 7.7580 10.3989 6.3603 9.5045 11.9711 5.5576 4.9901 4.6893 5.2432 4.7722 12.5242 9.1968 5.2521 4.7333 2.8355 2.8678 2.8765 2.8889 4.1175 3.9744 4.2202 3.6358 6.8444 5.9896 6.2788 6.2138 6.3773 5.6210 5.8502 6.0821 6.3918 1.7511 1.8343 2.0497 1.5862 2.1395 2.2393 1.8762 2.2339 2.9239 3.7329 4.6676 1.2492 1.2940 1.2420 1.2701 2.0268 1.4557 1.4605 1.4627 2.5702 1.3896 1.4620 1.3961 1.3774 3.4560 6.0832 5.9958 5.9210 2.5046 1.3153 1.3261 1.3549 2.1570 2.3948 2.2554 2.1090 2.1789 1.6283 1.6274 1.6353 1.6594 3.4091 1.2218 1.0790 1.7556 1.0634 1.2722 3.6618 1.1301 1.1509 1.1406 1.1406 3.8194 1.3447 1.3377 1.3385 1.3415 7.0475 6.4366 7.7446 8.0736 2.2334 2.2293 2.2691 2.2693 2.1131 2.1318 2.1050 2.1111 5.8058 5.8839 5.9364 5.8868 6.0253 6.0435 5.9316 5.9286 1.0850 1.0850 1.0850 1.0850 1.0896 1.0892 1.0896 1.0892 1.0945 1.0945 1.0951 1.0951 1.0998 1.0997 1.0957 1.0953 1.0970 1.0968 1.0942 1.0936
irintensity: 0.2636 0.6800 0.0201 0.0419 0.0071 0.3441 0.6591 0.9394 0.0571 0.5666 0.1186 5.4310 0.3946 1.4767 2.4133 0.3842 0.5413 0.3992 0.3837 1.0419 0.6864 19.1807 3.3281 0.5383 0.0826 0.8285 0.9154 0.0454 3.1002 1.4438 3.9636 0.8832 23.1656 20.2526 1.0903 1.1938 0.4278 45.4613 13.2391 0.6539 50.9982 25.1589 52.8577 32.6802 147.6094 26.6348 92.9278 2.3131 17.7798 9.7841 2.6645 10.0956 0.1136 0.2197 0.7726 0.1435 0.0592 0.0217 1.0545 0.8346 0.2196 0.1921 0.0657 0.2448 0.3071 0.0091 0.8272 2.6911 0.3672 0.7768 0.1405 0.2164 0.0150 0.0076 7.5456 15.0581 1.1653 1.3258 5.1510 2.4172 6.6010 1.5025 40.7797 1.6135 0.2243 4.1980 0.5725 3.5639 41.2576 1.7979 17.9512 7.7426 0.9165 6.9397 1.3949 4.1696 0.7387 1.1448 0.1301 1.0152 0.5580 0.2987 10.2161 24.4941 11.9195 8.0588 11.8237 6.7536 13.2724 11.9145 0.2681 0.4861 0.2066 2.1960 0.2801 0.0860 0.3662 0.4905 0.0921 0.1685 0.0127 0.0095 21.9964 11.4743 6.6288 6.3371 21.8434 32.4047 22.9898 43.6901 37.5846 15.5258 14.6125 7.1156 9.1544 1.3903 2.1318 3.6164
temp: 298.150 k
press: 1.00000 atm
elementType: 17 17 6 6 6 6 6 6 6 6 6 6 6 6 6 6 6 6 6 6 6 6 6 6 6 6 6 6 1 1 1 1 1 1 1 1 1 1 1 1 1 1 1 1 1 1 1 1
symmnumber: 1
zpe: 979659.8 jmol-1
zpe.correction: 0.373133 hartree
zpe.thermalcorrener: 0.396796 hartree
zpe.thermalcorrenthalpy: 0.397740 hartree
zpe.thermalcorrgfe: 0.320271 hartree
zpe.sumelectzpe: -1920.953890 hartree
zpe.sumelectthermal: -1920.930227 hartree
zpe.sumelectthermalent: -1920.929282 hartree
zpe.sumelectthermalfe: -1921.006751 hartree
dipole: -0.0081 0.0247 -0.0091
dipole: 0.0276
quadrupole: -154.6282 -160.6445 -178.6984
quadrupole: 0.1196 -0.0421 2.7230
quadrupole: 10.0288 4.0125 -14.0413 0.1196 -0.0421 2.7230
hfenergy: -1921.3270229 hartree
pointgroup: C01 [X(C26H20Cl2)]
dipole: 0.0077377 -0.0066617 -0.0036749 debye
polarizability: 334.0957583|19.3211404|316.110144|9.1091382|-13.9409704|224.936403 unknown
InChI: InChI=1S/C26H20Cl2/c27-25(21-13-5-1-6-14-21,22-15-7-2-8-16-22)26(28,23-17-9-3-10-18-23)24-19-11-4-12-20-24/h1-20H
charge 0 multiplicity 1
48 atoms
Cl -0.149431 0.145066 2.304382
Cl 0.072954 -0.176007 -2.300779
C  -0.435054 0.563951 0.366399
C  0.334505 -0.621185 -0.366177
C  -1.963473 0.651775 0.220447
C  0.217191 1.942652 0.14366
C  -0.209457 -2.053112 -0.227032
C  1.859269 -0.596789 -0.137154
C  -2.637585 1.60571 1.034053
C  -0.317757 2.79426 -0.860777
C  0.388384 -3.053351 -1.04461
C  2.401432 -1.421443 0.885983
C  -2.732664 -0.107645 -0.696962
C  1.346215 2.389223 0.875825
C  -1.214031 -2.45108 0.690436
C  2.742366 0.226378 -0.880001
C  -4.030887 1.786088 0.944841
C  0.263345 4.052934 -1.125779
C  -0.013061 -4.39997 -0.961158
C  3.785758 -1.416639 1.160099
C  -4.131048 0.07868 -0.792052
C  1.919757 3.653264 0.618677
C  -1.611912 -3.805013 0.780143
C  4.129121 0.220579 -0.614523
C  -4.789186 1.020819 0.026465
C  1.384313 4.491351 -0.384863
C  -1.019819 -4.785635 -0.04383
C  4.658692 -0.597499 0.408524
H  -2.059027 2.198493 1.749833
H  -1.18711 2.469293 -1.438815
H  1.165765 -2.763344 -1.758751
H  1.737792 -2.06366 1.471163
H  -2.25557 -0.836051 -1.353541
H  1.766143 1.754691 1.660032
H  -1.683074 -1.72162 1.351576
H  2.346066 0.858831 -1.678015
H  -4.524353 2.521807 1.589355
H  -0.165547 4.690954 -1.906417
H  0.458291 -5.147191 -1.608983
H  4.180146 -2.058668 1.95549
H  -4.701387 -0.518954 -1.511651
H  2.786123 3.979751 1.204447
H  -2.388513 -4.086557 1.499804
H  4.792958 0.857938 -1.209023
H  -5.873597 1.159313 -0.048152
H  1.829042 5.473264 -0.582607
H  -1.334095 -5.832986 0.026695
H  5.735406 -0.602267 0.612722
