program: Gaussian 09
title: 000021189
version: EM64L-G09RevD.01
frameworkgroup: C1[X(C5H13IN)]
method: RPBEPBE
basis: SDD
operation: Freq
keyword: #p
keyword: freq=noraman
keyword: PBEPBE/SDD
title: #p freq=noraman PBEPBE/SDD
converged: YES YES NO NO
title: Mulliken charges:
elementType: I N C C C C C H H H H H H H H H H H H H
charge: 0.222557 -0.118087 -0.258115 -0.540303 -0.548234 -0.546467 -0.848793 0.285878 0.285971 0.272019 0.269427 0.271827 0.271720 0.268854 0.273314 0.271002 0.272615 0.268811 0.313416 0.312587
chargesum: 1.00000
title: Mulliken charges with hydrogens summed into heavy atoms:
elementType: I N C C C C C
charge: 0.222557 -0.118087 0.313733 0.272970 0.265655 0.265961 -0.222789
polarizability: 1.13457110e+02 6.89836220e+00 6.30007928e+01 2.85329170e-03 -2.55142374e-03 5.73925038e+01
1716.lowfreq: -32.6790 -11.9409 -0.0002 -0.0002 0.0004 6.4352 53.4127 85.8859 131.8285
frequency: 51.3596 85.8009 131.8231 183.3820 192.2747 265.8095 268.7365 339.5942 340.7912 430.7022 433.0419 465.2224 614.0958 720.3782 761.6354 840.4114 913.6574 937.5127 972.4681 1043.5740 1055.0559 1087.4313 1110.1240 1161.7495 1199.6535 1226.7267 1242.5864 1243.5124 1321.7584 1364.1378 1422.9884 1423.4544 1447.5791 1451.5477 1455.0910 1464.1283 1465.0839 1469.0632 1486.9537 1487.7383 1498.8736 3026.1916 3027.0980 3029.3857 3033.2655 3067.5810 3103.5702 3141.8045 3143.3892 3145.2447 3148.4673 3150.6626 3153.9342 3156.5837
redmass: 2.2487 2.1727 3.8356 4.8420 1.1116 1.0535 1.0326 2.2582 2.6880 2.6866 2.3094 2.7496 4.6420 4.1676 1.1392 3.4410 2.3286 2.7234 1.3761 1.1970 2.8331 1.1867 1.5063 1.2824 1.2603 1.6319 1.6768 1.8219 1.2139 1.2562 1.1425 1.1426 1.0924 1.1135 1.0454 1.0942 1.0419 1.0780 1.0515 1.0517 1.0550 1.0325 1.0320 1.0403 1.0521 1.0556 1.1087 1.1056 1.1059 1.1056 1.1053 1.1061 1.1050 1.1102
irintensity: 0.1048 0.2542 3.1330 4.3055 0.0274 0.0468 0.3630 0.1730 0.1207 1.0978 0.1880 0.2111 7.1066 0.2641 15.8743 67.6721 4.8989 20.3172 13.3011 0.0133 12.5576 0.9044 5.8951 0.4212 7.4346 3.1237 1.1009 0.4010 1.3696 1.2950 19.0282 19.7408 5.4870 5.7074 0.5638 4.9872 0.2229 5.1646 54.9521 44.7041 91.4038 1.7422 2.6675 1.6445 5.5898 8.1611 0.6490 0.2403 0.6977 0.2595 7.3374 3.9070 6.6444 0.9849
temp: 298.150 k
press: 1.00000 atm
elementType: 53 7 6 6 6 6 6 1 1 1 1 1 1 1 1 1 1 1 1 1
symmnumber: 1
zpe: 468964.2 jmol-1
zpe.correction: 0.178619 hartree
zpe.thermalcorrener: 0.188189 hartree
zpe.thermalcorrenthalpy: 0.189133 hartree
zpe.thermalcorrgfe: 0.142348 hartree
zpe.sumelectzpe: -263.722091 hartree
zpe.sumelectthermal: -263.712521 hartree
zpe.sumelectthermalent: -263.711577 hartree
zpe.sumelectthermalfe: -263.758362 hartree
dipole: -11.7237 -0.1151 -0.0018
dipole: 11.7242
quadrupole: -18.9260 -50.9957 -51.8747
quadrupole: 0.2139 0.0020 0.0036
quadrupole: 21.6728 -10.3969 -11.2759 0.2139 0.0020 0.0036
hfenergy: -263.90071 hartree
pointgroup: C01 [X(C5H13I1N1)]
dipole: -4.5779576 -0.5641225 0.0284046 debye
dipolederiv: -0.146676 0.031904 -0.0009544 -0.0085716 0.0335139 0.0008944 0.0008206 0.0009494 0.0581478 -0.652488 0.0077828 0.0003461 0.027254 -0.3161916 0.0003744 -0.0001364 0.0004784 -0.2974288 0.8141757 0.1267454 -0.0062301 -0.0886856 0.0378941 0.0016937 0.0028388 0.0016111 0.0728095 0.1338983 -0.1300986 0.0057063 -0.2274551 0.2308839 -0.0080186 0.0108711 -0.0074634 0.0650753 0.0484425 0.0245559 0.0391427 0.0339247 0.1401462 0.1175588 0.0938269 0.1273639 0.2316715 0.0482462 0.0227767 -0.0409255 0.0243689 0.1188923 -0.1065724 -0.0981329 -0.1171789 0.2540315 0.1451267 0.1098659 -0.0039205 0.1835142 0.0494664 -0.0011918 -0.0079951 -0.0013414 0.0224705 0.0419361 0.0041774 0.0383978 0.0141815 0.0481413 -0.05643 0.0413394 -0.0719817 0.0094565 0.0421082 0.0009295 -0.0383087 0.0108649 0.0576867 0.0519572 -0.0422797 0.068066 -0.0002962 0.1034775 -0.0126383 0.0746165 0.0161116 0.0841732 0.0283163 0.0377936 0.07091 -0.0036595 -0.0266688 -0.0266924 0.0021378 -0.0707601 0.0471186 0.0048951 0.0041331 0.0043989 0.1345348 0.1028952 -0.0209822 -0.0736996 0.0117513 0.0733139 -0.0359858 -0.0403648 -0.0789012 0.0079716 0.0822268 0.106447 -0.0169059 0.0946317 0.0347396 -0.005129 -0.0383709 0.0307723 0.077814 -0.0529814 -0.0468542 -0.0005926 -0.0022063 0.1212081 -0.0202662 0.052402 -0.0079199 0.0963568 0.1318481 -0.0355964 0.0428803 -0.0353862 0.0307799 0.0835513 0.0261438 0.0294358 0.0241459 0.0791194 0.1089733 0.0050601 0.0987809 0.0352756 0.0109535 0.0278519 -0.0247566 0.0809229 0.133348 -0.0380253 -0.0362861 -0.0334231 0.0186575 -0.0853992 -0.0196429 -0.0296198 0.0346203 -0.0509855 -0.0496301 0.002651 -0.0107981 0.1222887 0.0179081 -0.0534407 0.0039405 0.0927738 0.0110911 -0.0942806 -0.0642694 -0.0203848 0.0113774 -0.0649555 -0.0355451 -0.0617106 0.0242844 0.0118598 -0.08936 0.071154 -0.0177128 0.020634 0.0658459 0.0378873 0.062947 0.0142973 unknown
polarizability: 111.2712637|12.3612067|65.1742669|-0.5482365|-0.3091147|57.4048764 unknown
InChI: InChI=1S/C5H13IN/c1-7(2,3)5-4-6/h4-5H2,1-3H3
charge 1 multiplicity 1
20 atoms
I  3.490174 0.520773 -0.028454
N  -1.004186 0.00303 -0.00118
C  0.46101 0.550761 -0.024135
C  -1.945743 1.208934 -0.057844
C  -1.266816 -0.89227 -1.211149
C  -1.270477 -0.777156 1.28525
C  1.552197 -0.522472 0.014197
H  0.544896 1.224232 0.846286
H  0.542406 1.156168 -0.943459
H  -1.764012 1.766294 -0.989288
H  -2.987513 0.854485 -0.033101
H  -1.75284 1.859017 0.808967
H  -0.652104 -1.800998 -1.139956
H  -2.331794 -1.170431 -1.222585
H  -1.015469 -0.339713 -2.129406
H  -0.63509 -1.673905 1.312791
H  -1.048154 -0.132437 2.149325
H  -2.32942 -1.076986 1.305848
H  1.563093 -1.178215 -0.867875
H  1.567143 -1.11111 0.942369
