program: Gaussian 09
title: 000237074
version: EM64L-G09RevD.01
frameworkgroup: C1[X(C9H9NS)]
method: RPBEPBE
basis: SDD
operation: Freq
keyword: #pfreq=noraman
keyword: PBEPBE/SDD
title: #p freq=noraman PBEPBE/SDD
converged: YES YES NO NO
title: Mulliken charges:
elementType: S N C C C C C C C C C H H H H H H H H H
charge: 0.182272 -0.536572 0.594867 -0.370228 -0.020092 -0.414489 -0.507563 -0.406647 -0.267630 -0.230716 -0.238486 0.261196 0.234298 0.229482 0.239976 0.243529 0.226884 0.228719 0.278188 0.273012
chargesum: 0.00000
title: Mulliken charges with hydrogens summed into heavy atoms:
elementType: S N C C C C C C C C C
charge: 0.182272 0.014627 0.594867 -0.370228 -0.020092 -0.153293 -0.043782 -0.166671 -0.024101 -0.003832 -0.009767
polarizability: 1.84714861e+02 -2.89351049e+00 1.18792367e+02 -5.66675207e+00 -1.40702942e-01 5.62708255e+01
1716.lowfreq: -11.9610 -6.5897 -3.1434 -0.0013 -0.0007 -0.0006 33.4206 91.2158 178.2522
frequency: 33.3969 91.2114 178.2514 187.2540 217.5915 285.5547 334.8580 374.7775 424.4549 458.6016 476.1266 544.3946 572.3742 584.4226 616.4695 673.5493 683.9615 736.3437 758.2899 841.8002 849.9580 867.7549 882.8460 945.6949 982.9876 1015.1696 1035.9519 1068.0507 1094.0459 1125.2868 1136.8937 1170.8542 1209.4064 1254.2797 1302.3284 1331.0311 1334.5901 1392.4078 1431.2736 1445.2421 1453.9295 1551.5773 1583.7365 1602.5901 1646.3050 2989.8318 3046.4017 3127.8388 3137.7704 3151.2175 3162.0325 3166.8491 3461.2921 3589.0259
redmass: 2.9989 4.1790 2.7365 3.9377 2.3353 1.6436 4.2993 4.2154 3.3396 3.9376 8.5058 2.8476 2.5373 4.5189 3.0041 3.8057 6.6608 2.5502 1.4265 1.3301 3.2777 1.5216 1.5112 1.3983 1.3256 2.9467 3.3848 4.3752 2.5779 1.5121 1.4005 1.0817 1.5682 1.7985 1.7559 1.3031 1.2848 5.4697 2.4590 1.0822 2.9386 6.4053 6.8276 6.8147 1.0856 1.0603 1.1027 1.0856 1.0892 1.0951 1.0944 1.1004 1.0450 1.0980
irintensity: 1.7016 0.0960 5.2893 3.3052 20.7826 44.7957 1.0866 0.9928 4.1350 9.0935 0.5041 57.3161 77.3636 22.8934 191.2005 121.5158 20.9407 27.4936 53.7678 18.8333 1.6966 3.4815 20.3575 5.4376 0.1163 7.6753 0.9367 16.7231 20.1209 9.1769 11.7146 1.1358 7.5250 2.0677 1.1808 0.8979 17.4321 2.2684 17.9238 12.3119 15.8462 3.2826 2.4360 0.0589 32.3082 39.4279 17.2324 0.9536 4.6903 23.6456 8.9821 26.2252 4.7305 2.6519
temp: 298.150 k
press: 1.00000 atm
elementType: 16 7 6 6 6 6 6 6 6 6 6 1 1 1 1 1 1 1 1 1
symmnumber: 1
zpe: 410439.6 jmol-1
zpe.correction: 0.156328 hartree
zpe.thermalcorrener: 0.166171 hartree
zpe.thermalcorrenthalpy: 0.167115 hartree
zpe.thermalcorrgfe: 0.120399 hartree
zpe.sumelectzpe: -800.379318 hartree
zpe.sumelectthermal: -800.369475 hartree
zpe.sumelectthermalent: -800.368531 hartree
zpe.sumelectthermalfe: -800.415247 hartree
dipole: -0.8192 0.3507 0.4242
dipole: 0.9869
quadrupole: -71.8352 -64.5114 -74.7673
quadrupole: -1.1621 -0.5473 -0.5520
quadrupole: -1.4640 5.8599 -4.3960 -1.1621 -0.5473 -0.5520
hfenergy: -800.5356461 hartree
pointgroup: C01 [X(C9H9N1S1)]
dipole: 0.3131286 0.1663639 -0.1581895 debye
dipolederiv: -0.3976352 0.0317363 0.0541927 -0.0370527 -0.2873412 -0.0147639 0.0714693 -0.0472772 0.0447217 -1.256272 0.0348391 -0.0940518 0.0867572 -0.2273931 -0.0906295 -0.1387736 -0.0888944 -0.3873671 0.1629871 0.0354111 -0.0095646 -0.2516518 -0.1889781 -0.0036057 -0.0132579 -0.0258457 0.0804346 0.4043432 0.2176755 -0.0502248 0.391442 -0.0242935 -0.0318625 -0.0220707 -0.0089301 -0.1050817 0.0129436 -0.1380481 -0.0766167 -0.0449083 0.5441359 0.0332155 -0.0440594 0.059747 -0.2550684 -0.2947501 -0.1495609 -0.028294 -0.1164319 -0.1284353 0.0121043 0.0029496 0.0265544 -0.1734248 0.7066862 0.0167545 0.0748007 0.0796263 0.1612172 0.1000751 0.1132106 0.066429 0.4009494 -0.0011006 -0.0289854 -0.0201775 0.0060427 0.1137873 0.026942 -0.0190274 0.0306831 -0.1687936 -0.0978685 -0.0658244 -0.0015513 -0.1309732 0.0791827 0.029606 -0.0144115 0.0233537 -0.1246208 0.0161132 0.1017212 -0.0155351 0.1182217 -0.0336285 0.0057234 -0.0130186 0.0010978 -0.1675813 -0.0472198 -0.0378244 -0.0266019 -0.0075333 0.0527512 0.0164876 -0.0154202 0.024431 -0.1716459 0.0689528 0.0151788 0.0142504 0.0751564 -0.056822 -0.0282976 0.0219324 -0.0247918 0.1813248 -0.0522101 -0.027365 0.0308186 -0.0826701 0.0378161 0.1238372 0.025535 0.0572732 -0.0570213 -0.0083962 0.0104581 -0.0222663 0.0490204 -0.1283258 -0.0936975 -0.0138963 -0.0422168 0.0733284 0.0729649 0.0300878 0.0132615 -0.0177639 -0.1014581 -0.0224096 0.0078084 -0.0272578 0.1598928 0.0917589 -0.0246967 0.0064329 0.031609 -0.0731778 -0.0240155 0.0116193 -0.018296 0.1619355 -0.08558 -0.1005055 0.0167651 -0.1069078 0.0275111 -0.0007475 0.0167222 -0.0013407 0.1613659 -0.0954955 0.0825586 0.0351757 0.0798987 0.0457252 -0.0195634 0.0364877 -0.0199704 0.1601854 0.4475652 0.1059102 -0.0151613 0.0111157 0.0192057 -0.0232956 -0.0615907 -0.0153482 0.1394553 0.352213 -0.1095208 0.1143478 -0.1329967 0.168521 0.0048969 0.047792 0.0305997 0.0470111 unknown
polarizability: 184.1031329|6.2681463|118.6155783|-7.6376976|5.6561929|57.0593423 unknown
InChI: InChI=1S/C9H9NS/c10-6-8-5-7-3-1-2-4-9(7)11-8/h1-5H,6,10H2
charge 0 multiplicity 1
20 atoms
S  -1.041334 -1.53448 0.10325
N  -4.113524 -0.224616 -0.658224
C  0.515728 0.657639 0.125396
C  0.599595 -0.766133 -0.011545
C  -1.79872 0.119625 0.333323
C  -0.848256 1.119396 0.315293
C  -3.303858 0.235421 0.48889
C  1.714439 1.418946 0.061156
C  1.827197 -1.428905 -0.208975
C  2.945757 0.765113 -0.133864
C  3.003627 -0.649545 -0.268452
H  -1.109498 2.174817 0.435788
H  -3.641426 -0.325615 1.380769
H  -3.53588 1.299617 0.684974
H  1.672635 2.509244 0.16385
H  1.874791 -2.517797 -0.312264
H  3.871017 1.349448 -0.183137
H  3.969972 -1.142779 -0.419629
H  -4.185306 -1.242793 -0.745184
H  -3.858953 0.2163 -1.547713
