program: Gaussian 09
title: 000237083
version: EM64L-G09RevD.01
frameworkgroup: C1[X(C17H10Br4O)]
method: RPBEPBE
basis: SDD
operation: Freq
keyword: #p
keyword: freq=noraman
keyword: PBEPBE/SDD
title: #p freq=noraman PBEPBE/SDD
converged: YES YES NO NO
title: Mulliken charges:
elementType: Br Br Br Br O C C C C C C C C C C C C C C C C C H H H H H H H H H H
charge: 0.047765 -0.034132 0.027455 0.021262 -0.298928 0.136128 0.451497 0.350603 -0.491379 0.332211 0.342991 -0.908232 -0.360058 -0.356095 -0.352908 -0.356652 -0.183848 -0.200670 -0.193915 -0.183675 -0.227293 -0.231338 0.305417 0.311463 0.262371 0.262804 0.238354 0.266722 0.255214 0.258758 0.254740 0.253367
chargesum: 0.00000
title: Mulliken charges with hydrogens summed into heavy atoms:
elementType: Br Br Br Br O C C C C C C C C C C C C C C C C C
charge: 0.047765 -0.034132 0.027455 0.021262 -0.298928 0.136128 0.451497 0.350603 -0.491379 0.332211 0.342991 -0.291352 -0.097687 -0.093291 -0.114555 -0.089929 0.071367 0.058088 0.060825 0.069692 -0.227293 -0.231338
polarizability: 4.90377240e+02 4.63781394e+00 3.17224082e+02 -8.86838081e+00 2.01730629e+00 1.14064894e+02
1716.lowfreq: -3.8787 -1.9181 -0.0004 -0.0004 -0.0003 2.0165 19.5814 24.2997 28.2675
frequency: 19.5739 24.2952 28.2631 32.4294 39.5314 52.0045 66.8136 77.4442 109.3736 130.9039 151.1663 153.7408 186.4267 218.1439 235.1010 250.2837 283.9505 297.2953 313.3883 324.7601 365.0689 389.2990 404.7792 408.9636 442.5813 489.1334 497.3975 511.1366 553.3547 591.0604 623.0906 625.1372 657.6870 663.7943 693.2838 711.3206 721.2156 730.9280 758.2718 829.8549 837.6202 840.6802 842.8127 883.2264 922.7311 964.3209 969.1551 977.2109 980.4814 991.0961 992.4559 1019.1422 1050.2408 1065.1215 1068.2660 1088.0881 1113.1952 1121.7257 1141.5163 1196.2501 1197.5639 1214.2513 1242.9071 1289.0910 1302.2612 1303.2091 1354.6508 1359.8569 1392.7268 1400.3903 1406.4177 1454.2514 1459.3227 1473.4199 1549.3968 1558.8381 1567.0743 1579.1715 1598.7177 1604.2698 3074.1891 3145.7811 3156.7390 3157.0709 3161.2139 3163.9487 3172.4546 3178.0667 3179.8976 3184.6985
redmass: 4.0309 16.4632 16.2249 21.0822 16.5083 4.7280 10.7356 16.1753 14.4208 11.2830 19.8458 11.2984 9.9670 8.6795 5.1480 4.6965 6.3876 8.0604 7.2365 4.8066 6.6294 7.0291 2.8966 2.9978 7.2151 3.4240 4.0309 6.2820 5.2135 4.8097 7.0351 6.9911 7.1991 7.0288 7.5503 4.9658 3.6344 4.7344 6.3734 1.2936 1.2873 1.5030 1.5332 1.8571 4.6764 1.3569 1.3436 1.3702 1.4337 4.6676 4.6567 7.1107 7.5549 2.5000 2.2836 2.6861 1.3769 1.4127 1.8420 1.1218 1.1221 1.1434 4.4650 3.1055 1.2829 1.4037 5.1081 5.1342 4.9279 3.6159 3.4511 1.3133 2.2200 2.2371 8.4290 7.3948 7.9256 8.4768 6.0361 6.5158 1.0577 1.0908 1.0885 1.1100 1.0883 1.0889 1.0959 1.0975 1.0963 1.0970
irintensity: 0.0102 0.1571 0.1701 0.0288 0.5556 0.0901 0.2247 0.0714 0.8093 0.8295 0.6030 0.2049 0.7265 1.1289 6.2429 2.3869 1.3850 8.1356 4.2527 6.0583 4.1730 16.1430 0.1165 0.2176 8.9948 36.4775 6.5232 6.9613 48.3466 4.3830 1.0810 2.5080 22.6130 52.3063 1.2270 2.4238 4.1333 7.9125 22.3124 7.4937 2.4658 20.7029 90.3710 12.8222 57.0609 0.1517 0.3901 0.6564 5.6355 100.1993 12.4865 29.1830 8.3615 12.8942 81.6716 10.0709 5.8931 3.7068 2.4048 0.5942 4.2995 61.1314 20.2024 8.5612 0.3533 2.4055 1.1512 2.8712 11.2889 7.3612 16.2368 49.7654 86.0029 167.2502 1.8196 7.8182 0.0482 32.1208 14.7345 38.0682 8.4704 0.3334 2.2148 0.4522 2.1983 1.3766 3.5308 3.2744 4.4764 2.9758
temp: 298.150 k
press: 1.00000 atm
elementType: 35 35 35 35 8 6 6 6 6 6 6 6 6 6 6 6 6 6 6 6 6 6 1 1 1 1 1 1 1 1 1 1
symmnumber: 1
zpe: 565890.1 jmol-1
zpe.correction: 0.215536 hartree
zpe.thermalcorrener: 0.236270 hartree
zpe.thermalcorrenthalpy: 0.237214 hartree
zpe.thermalcorrgfe: 0.159250 hartree
zpe.sumelectzpe: -781.346680 hartree
zpe.sumelectthermal: -781.325946 hartree
zpe.sumelectthermalent: -781.325002 hartree
zpe.sumelectthermalfe: -781.402966 hartree
dipole: -0.1086 -0.4549 -1.8622
dipole: 1.9201
quadrupole: -174.0112 -163.9404 -168.4062
quadrupole: 4.0861 0.2586 -5.3929
quadrupole: -5.2253 4.8455 0.3797 4.0861 0.2586 -5.3929
hfenergy: -781.5622162 hartree
pointgroup: C01 [X(C17H10Br4O1)]
dipole: 0.0369781 -0.1645362 -0.7363574 debye
polarizability: 490.5838452|5.0475142|275.6034613|3.1851223|-81.9923673|155.4789088 unknown
InChI: InChI=1S/C17H10Br4O/c18-9-14-15(21)17(11-3-7-13(20)8-4-11)22-16(14)10-1-5-12(19)6-2-10/h1-8H,9H2
charge 0 multiplicity 1
32 atoms
Br -1.710194 -3.381463 1.091882
Br 2.222327 -3.084905 2.709209
Br 6.429282 2.455429 -1.192776
Br -6.74654 2.280272 -0.531181
O  -0.104096 0.241607 -0.143432
C  1.07399 -0.502004 0.068143
C  0.724845 -1.795372 0.483298
C  -1.226799 -0.578726 0.155729
C  -0.723159 -1.82159 0.540273
C  2.33134 0.185389 -0.209632
C  -2.530755 0.062111 0.001277
C  1.627702 -2.939229 0.724954
C  2.353343 1.289472 -1.110098
C  3.549038 -0.216009 0.409839
C  -3.753085 -0.660761 0.105175
C  -2.5928 1.461487 -0.26756
C  3.555301 1.962893 -1.399897
C  4.757995 0.448503 0.11974
C  -4.993865 -0.01027 -0.050244
C  -3.827588 2.118286 -0.425816
C  4.750982 1.529435 -0.786502
C  -5.021638 1.37447 -0.314447
H  2.577973 -2.871756 0.178778
H  1.139621 -3.908688 0.555987
H  1.423917 1.611931 -1.588816
H  3.554105 -1.013427 1.159991
H  -3.746574 -1.735247 0.302431
H  -1.665331 2.03512 -0.345291
H  3.56238 2.806089 -2.096085
H  5.685893 0.137156 0.60724
H  -5.924124 -0.579002 0.031422
H  -3.858484 3.192399 -0.628394
