program: Gaussian 09
title: 000237062
version: EM64L-G09RevD.01
frameworkgroup: C1[X(C16H10ClNS)]
method: RPBEPBE
basis: SDD
operation: Freq
keyword: #p
keyword: freq=noraman
keyword: PBEPBE/SDD
title: #p freq=noraman PBEPBE/SDD
converged: NO YES NO NO
title: Mulliken charges:
elementType: Cl S N C C C C C C C C C C C C C C C C H H H H H H H H H H
charge: -0.061980 0.197202 -0.525443 -0.551057 0.620996 0.368811 0.431039 0.619524 -0.338220 -0.463334 -0.465984 -0.387796 -0.428157 -0.399971 -0.267224 -0.245203 -0.250298 -0.068091 -0.260616 0.308187 0.224901 0.241805 0.243806 0.242431 0.251507 0.244442 0.229019 0.230169 0.259533
chargesum: 0.00000
title: Mulliken charges with hydrogens summed into heavy atoms:
elementType: Cl S N C C C C C C C C C C C C C C C C
charge: -0.061980 0.197202 -0.217255 -0.551057 0.620996 0.368811 0.431039 0.619524 -0.338220 -0.238433 -0.224179 -0.143990 -0.185726 -0.148464 -0.022782 -0.016184 -0.020129 -0.068091 -0.001083
polarizability: 4.04128802e+02 6.85578189e+00 2.11784609e+02 -6.75471263e-03 -4.38467820e-03 7.39482317e+01
1716.lowfreq: -24.1986 -0.0020 -0.0019 -0.0017 2.5381 4.0833 5.0615 61.8626 100.0787
frequency: -24.0411 61.8611 100.0786 116.7866 116.8052 189.3437 193.9080 221.7224 282.0448 289.3558 313.9681 324.3268 370.9926 411.0568 417.2333 439.0455 451.1592 489.6505 515.1266 526.1102 527.4215 538.4940 550.3697 575.1527 640.5902 653.5565 659.2885 702.6591 704.9110 743.6146 753.0612 785.8102 795.4227 807.7469 812.1492 847.0083 872.1704 889.5841 926.7329 939.0944 940.7608 961.8791 986.7372 1010.1220 1035.6800 1043.3662 1087.8196 1132.8130 1137.6074 1164.0607 1177.4622 1230.3998 1239.0756 1250.1680 1270.6528 1288.7949 1330.7286 1365.8401 1390.7914 1402.7021 1420.9654 1429.5798 1471.9470 1479.2138 1496.6348 1521.2514 1578.4217 1580.4865 1597.5394 1614.9875 1636.8695 3112.7615 3122.6174 3131.2575 3142.0007 3144.0767 3146.7968 3148.8474 3164.2894 3183.4199 3560.4234
redmass: 9.6481 5.6723 6.2347 5.9893 6.9696 9.1714 4.3798 4.5169 8.8415 5.3671 4.9697 8.9813 8.1064 3.0796 8.1454 2.8895 5.9196 7.9118 1.3315 3.4432 7.4086 3.2249 7.8210 4.0408 6.9581 6.6547 3.3173 7.2010 3.4497 6.3323 1.3399 2.7550 1.3471 5.5822 1.4941 1.5930 1.7191 6.1851 1.3495 7.1140 1.3546 1.4144 1.3407 4.4180 3.0666 4.0748 1.9458 1.4454 1.7567 1.2897 1.1066 1.7511 2.3009 1.4879 1.6989 1.9985 2.4862 3.2385 5.9802 3.0038 3.4830 4.5891 2.7948 3.3547 2.4750 3.1701 5.2858 7.3531 4.5961 6.2570 7.0866 1.0881 1.0863 1.0878 1.0902 1.0918 1.0947 1.0961 1.1005 1.0955 1.0761
irintensity: 0.0160 0.0432 0.1045 0.5339 0.3160 1.2486 5.5937 0.7584 1.4485 2.2618 2.1392 0.0040 5.4109 2.6255 0.5711 17.5409 4.2517 8.8131 51.6450 7.3633 0.8539 1.1805 1.2871 27.1533 3.4820 5.9453 0.7547 7.7106 0.4295 3.4849 36.3666 2.7737 40.5805 9.7169 99.0329 54.3364 3.3739 58.3962 0.1538 35.5886 0.1912 3.3217 0.0969 13.3082 23.6585 28.4885 48.0261 19.6705 1.4636 5.9237 2.9453 5.7994 7.4284 10.6418 27.0260 16.1951 41.4890 54.2646 14.9523 20.9430 52.6077 3.6650 27.5382 496.1088 52.6396 200.6364 43.7333 133.2148 48.7329 1.4588 47.6348 10.0668 5.1187 5.1301 4.9049 1.1086 18.6090 26.7944 32.9133 0.9572 27.3549
temp: 298.150 k
press: 1.00000 atm
elementType: 17 16 7 6 6 6 6 6 6 6 6 6 6 6 6 6 6 6 6 1 1 1 1 1 1 1 1 1 1
symmnumber: 1
zpe: 554392.9 jmol-1
zpe.correction: 0.211157 hartree
zpe.thermalcorrener: 0.225057 hartree
zpe.thermalcorrenthalpy: 0.226001 hartree
zpe.thermalcorrgfe: 0.170570 hartree
zpe.sumelectzpe: -1527.315667 hartree
zpe.sumelectthermal: -1527.301767 hartree
zpe.sumelectthermalent: -1527.300823 hartree
zpe.sumelectthermalfe: -1527.356254 hartree
dipole: -1.8474 1.7332 -0.0001
dipole: 2.5331
quadrupole: -123.5077 -104.6952 -132.5171
quadrupole: -2.9320 -0.0033 -0.0036
quadrupole: -3.2677 15.5448 -12.2771 -2.9320 -0.0033 -0.0036
hfenergy: -1527.5268241 hartree
pointgroup: C01 [X(C16H10Cl1N1S1)]
dipole: -0.7444393 -0.6625941 0.0000296 debye
polarizability: 403.637134|-11.8882075|212.2762768|0.0066374|-0.0045603|73.9482317 unknown
InChI: InChI=1S/C16H10ClNS/c17-11-6-8-15-14(9-11)18-13-7-5-10-3-1-2-4-12(10)16(13)19-15/h1-9,18H
charge 0 multiplicity 1
29 atoms
Cl 6.250571 -0.666211 -0.000352
S  0.220849 1.668688 0.000699
N  1.093488 -1.403112 0.000626
C  -0.838051 0.154351 0.000289
C  -0.292994 -1.140639 0.00038
C  -2.260158 0.352274 -0.000009
C  -3.135977 -0.806432 -0.000138
C  2.142359 -0.468756 0.000358
C  1.906829 0.934241 0.000262
C  -1.173088 -2.27373 0.000187
C  -2.554294 -2.113736 -0.000032
C  -2.862286 1.657183 -0.000147
C  -4.555095 -0.616016 -0.000372
C  3.480816 -0.940047 0.000131
C  2.993595 1.829179 -0.000063
C  -4.250801 1.809189 -0.00038
C  -5.109902 0.665647 -0.000487
C  4.545259 -0.021314 -0.000127
C  4.33173 1.366771 -0.000241
H  1.362772 -2.387051 0.000964
H  -0.733172 -3.279002 0.000191
H  -3.210185 -2.99114 -0.000148
H  -2.224476 2.547816 -0.000088
H  -5.202589 -1.501162 -0.000464
H  3.682051 -2.016813 0.00013
H  2.804633 2.908174 -0.00015
H  -4.687973 2.813744 -0.000491
H  -6.19674 0.800467 -0.000667
H  5.168525 2.069136 -0.00046
