program: Gaussian 09
title: 000237056
version: EM64L-G09RevD.01
frameworkgroup: C1[X(C10H8N2O2)]
method: RPBEPBE
basis: SDD
operation: Freq
keyword: #p
keyword: freq=noraman
keyword: PBEPBE/SDD
title: #p freq=noraman PBEPBE/SDD
converged: YES YES NO NO
title: Mulliken charges:
elementType: O O N N C C C C C C C C C C H H H H H H H H
charge: -0.426545 -0.245252 -0.298288 -0.030927 0.459627 0.249238 -0.321608 -0.369418 -0.343864 -0.305179 -0.220686 -0.211091 -0.241027 0.148773 0.256210 0.268301 0.285577 0.265775 0.231723 0.231287 0.231553 0.385822
chargesum: 0.00000
title: Mulliken charges with hydrogens summed into heavy atoms:
elementType: O O N N C C C C C C C C C C
charge: -0.040723 -0.245252 -0.298288 -0.030927 0.459627 0.249238 -0.065398 -0.101117 -0.058287 -0.039405 0.011037 0.020195 -0.009474 0.148773
polarizability: 1.81527202e+02 -1.23792878e+01 1.37777971e+02 -6.55340692e+00 -8.95646021e+00 6.38017530e+01
1716.lowfreq: -7.5360 0.0004 0.0004 0.0010 4.9773 8.8717 38.3183 47.2400 96.8446
frequency: 38.2849 47.2273 96.8400 133.0019 182.3468 199.8190 288.6770 321.8351 359.4536 407.4853 437.8526 502.9898 550.3407 557.7146 609.7442 626.8955 642.8241 652.0626 688.8037 693.9284 731.0557 765.3914 824.6790 833.5138 898.3539 907.0381 915.5450 955.3436 967.5371 990.4109 991.7502 1013.8093 1042.9686 1055.0022 1067.3091 1102.5076 1173.5893 1188.9355 1192.0872 1224.8475 1272.5603 1316.8046 1323.2855 1380.9025 1386.9825 1423.6254 1444.3313 1486.4353 1491.1685 1599.2440 1609.2262 1655.2022 3133.7107 3146.7559 3162.9647 3180.3269 3191.5136 3230.8954 3261.2229 3529.1485
redmass: 9.0098 4.9488 5.0144 5.3507 5.8096 6.1245 5.4503 6.4589 6.1030 2.8453 6.1238 4.4005 1.3644 4.4352 6.1707 2.7533 5.8640 5.4568 2.6232 3.4989 5.7540 1.7310 1.2685 1.2494 1.4065 4.3317 1.5387 5.8526 1.3870 3.8280 1.5198 4.2054 2.1404 1.3702 2.4731 1.9047 1.0517 1.1283 1.5905 2.9061 4.4865 3.0252 1.3316 4.9838 9.9268 4.0735 2.3687 2.6167 5.9067 6.6882 6.1204 8.6761 1.0855 1.0905 1.0962 1.0964 1.0964 1.0943 1.1043 1.0643
irintensity: 1.2921 0.6404 2.0516 1.5973 0.2281 1.1710 1.2385 2.5485 8.1929 0.3239 3.2617 5.5001 92.8864 19.5878 2.8125 41.1330 11.0410 40.9194 27.4766 22.5178 41.4862 65.0780 53.2446 1.6967 1.0495 13.4325 4.5576 246.0222 2.1055 0.2635 0.1828 30.6318 112.2041 51.8119 9.8530 26.9567 0.1435 0.8654 14.0021 18.4350 0.3080 71.4022 4.2254 29.9916 2.2212 30.9248 10.4597 69.6927 67.6175 4.6011 8.6946 263.5368 0.1677 15.6205 31.0645 5.7936 2.1959 2.8491 0.9610 52.7281
temp: 298.150 k
press: 1.00000 atm
elementType: 8 8 7 7 6 6 6 6 6 6 6 6 6 6 1 1 1 1 1 1 1 1
symmnumber: 1
zpe: 425309.0 jmol-1
zpe.correction: 0.161992 hartree
zpe.thermalcorrener: 0.173193 hartree
zpe.thermalcorrenthalpy: 0.174137 hartree
zpe.thermalcorrgfe: 0.123617 hartree
zpe.sumelectzpe: -644.819961 hartree
zpe.sumelectthermal: -644.808759 hartree
zpe.sumelectthermalent: -644.807815 hartree
zpe.sumelectthermalfe: -644.858336 hartree
dipole: -0.7668 -0.4815 0.0155
dipole: 0.9056
quadrupole: -64.8343 -77.1986 -81.6963
quadrupole: 0.6104 -0.6926 -4.5154
quadrupole: 9.7421 -2.6222 -7.1199 0.6104 -0.6926 -4.5154
hfenergy: -644.9819525 hartree
pointgroup: C01 [X(C10H8N2O2)]
dipole: 0.2866496 0.2115697 0.0007499 debye
dipolederiv: -1.2504238 -0.5479332 0.0714761 -0.4421266 -0.4939142 0.0047055 0.0864517 0.0040489 -0.4298672 -0.8136512 0.135156 -0.0619909 0.1384043 -0.9000482 0.1337184 0.0069688 0.1404422 -0.3254957 -0.470859 0.3295586 -0.0577578 0.4382952 0.0687967 -0.0847735 -0.0438834 -0.0308921 -0.0101718 0.0495093 -0.0455413 0.0076246 -0.4840372 -0.3195431 0.0401111 -0.0726052 0.0543062 -0.1810645 0.7369642 -0.1385579 0.0133994 -0.2398621 0.0614831 0.0648442 0.0418582 0.0208345 0.0857226 0.4315838 -0.0412786 -0.0086087 -0.1571216 -0.8751186 0.1496547 0.0561881 0.1064154 -0.0109146 -0.0719814 0.0883358 0.0491651 0.0761425 -0.0424484 0.0507033 0.0119067 0.0037904 -0.0882211 -0.1107679 -0.0463888 -0.0158527 -0.0191023 -0.0108998 0.0575808 0.0168515 0.0334576 -0.1025081 -0.2433147 -0.0186363 0.0128943 0.441191 0.0630582 -0.0332339 -0.0698026 -0.0194373 -0.1600199 -0.3987411 -0.1209364 0.027901 -0.2365093 0.2061482 -0.0281888 0.0853458 -0.0427128 -0.1200757 -0.0628268 -0.0936653 -0.0273531 -0.0835515 0.0545961 0.1209597 -0.0527225 0.1051115 -0.0814454 -0.0022316 0.0890389 0.0779567 0.1056188 -0.0128513 0.0978903 0.0978065 0.0916489 -0.0812334 0.0593518 -0.0368183 0.0136235 -0.0375978 -0.0639897 0.0431184 0.0099223 0.0530041 -0.1234027 1.6470061 0.2616294 0.0190762 0.3485367 1.7432267 -0.3128605 -0.0547062 -0.2739936 0.3283972 0.0433903 -0.0561658 -0.0694286 -0.0424686 0.0676277 -0.0627308 -0.084697 -0.034336 0.1088206 0.1010784 0.0600503 0.0233612 0.0452604 0.0399761 -0.0826133 0.0382716 -0.0565285 0.1166669 0.0306987 -0.028203 0.0057379 -0.0347211 0.134763 0.0058615 -0.0184428 0.0062533 0.1945037 0.0681104 0.0382474 -0.0037695 0.0612559 -0.0047223 0.0214047 0.0122906 0.0153478 0.1771286 0.0485325 0.050024 0.0213553 0.0757661 -0.0215504 -0.1105711 0.0313973 -0.1049125 0.0898822 -0.0162062 -0.0656035 -0.0666626 -0.0813967 0.0335021 -0.0907546 -0.0769027 -0.0863507 0.0896767 -0.1241084 0.0491914 -0.0089171 0.0519184 0.1018986 -0.0321104 -0.0081282 -0.0276898 0.1420128 0.3488866 0.1384967 -0.0232302 0.0761054 0.1700094 0.0472844 -0.0133685 0.0421926 0.3816086 unknown
polarizability: 183.2979208|-8.7944152|136.2184353|3.8709235|9.3909594|63.5905701 unknown
InChI: InChI=1S/C10H8N2O2/c13-10(14)9-6-7-11-12(9)8-4-2-1-3-5-8/h1-7,13H
charge 0 multiplicity 1
22 atoms
O  3.133604 1.923056 -0.297826
O  0.856379 2.373518 -0.409617
N  0.50198 -0.662121 0.125407
N  0.792981 -2.016229 0.262195
C  -0.893153 -0.289379 0.096347
C  1.679246 0.099597 0.034168
C  -1.361127 0.856472 0.777914
C  -1.792843 -1.147095 -0.580365
C  2.754071 -0.810937 0.130745
C  2.160665 -2.090407 0.266164
C  -2.740388 1.154446 0.757955
C  -3.169268 -0.840466 -0.589458
C  -3.64832 0.312266 0.075742
C  1.778327 1.539992 -0.234644
H  -0.666468 1.509291 1.310008
H  -1.407222 -2.040769 -1.07789
H  3.806913 -0.546543 0.089623
H  2.636506 -3.063214 0.37094
H  -3.103796 2.044671 1.281977
H  -3.865647 -1.501465 -1.116387
H  -4.717565 0.549846 0.065266
H  3.169725 2.897468 -0.494964
