program: Gaussian 09
title: 000237085
version: EM64L-G09RevD.01
frameworkgroup: C1[X(C19H23NO)]
method: RPBEPBE
basis: SDD
operation: Freq
keyword: #p
keyword: freq=noraman
keyword: PBEPBE/SDD
title: #p freq=noraman PBEPBE/SDD
converged: YES YES NO NO
title: Mulliken charges:
elementType: O N C C C C C C C C C C C C C C C C C C C H H H H H H H H H H H H H H H H H H H H H H H
charge: -0.461175 -0.201989 -0.253097 -0.363485 -0.344461 -0.397504 -0.410301 -0.398584 -0.238661 0.514378 0.458327 -0.450078 -0.392959 -0.390472 -0.411685 -0.231739 -0.238551 -0.244667 -0.225849 -0.234097 -0.246038 0.204057 0.249728 0.184630 0.188844 0.227712 0.204900 0.198598 0.199130 0.209163 0.190965 0.218600 0.200431 0.225279 0.272988 0.358378 0.275030 0.214597 0.223438 0.226064 0.226146 0.220926 0.219958 0.223122
chargesum: 0.00000
title: Mulliken charges with hydrogens summed into heavy atoms:
elementType: O N C C C C C C C C C C C C C C C C C C C
charge: -0.102796 -0.201989 -0.049040 0.070873 0.072094 0.005994 -0.002008 0.010981 -0.038230 0.514378 0.458327 -0.224799 -0.119970 -0.115443 -0.197088 -0.008300 -0.012487 -0.018521 -0.004922 -0.014139 -0.022915
polarizability: 2.36440946e+02 -1.66892439e+01 1.85615235e+02 -3.74156817e+00 1.67119757e+00 1.88260333e+02
1716.lowfreq: -20.9924 -10.3526 -5.8944 -0.0005 0.0007 0.0007 14.1841 26.5524 35.5821
frequency: 2.7429 24.4063 35.3735 50.8480 56.2378 77.2337 107.4342 145.4186 191.9916 204.3862 216.6624 237.6430 250.9129 278.9899 300.9739 321.9336 401.0127 406.8195 407.5205 415.8752 424.9209 442.5248 476.0466 502.0886 561.5022 582.1712 614.0002 616.3981 625.6032 688.9078 703.9927 708.3789 740.8601 766.1883 781.0569 793.8577 800.5783 819.6057 848.8661 850.9762 855.1675 860.0124 870.1908 899.2770 921.1234 929.5248 945.9599 955.9373 971.7118 975.2653 982.2475 989.6354 990.9407 997.4147 1001.8952 1017.3545 1027.3663 1030.1292 1040.9485 1069.2584 1077.3300 1084.0134 1087.8623 1117.0195 1143.3671 1148.7694 1169.1829 1171.6944 1179.6634 1190.7370 1196.5441 1205.1150 1218.4848 1225.8438 1251.9193 1266.5604 1274.7725 1283.3293 1292.6154 1317.8884 1326.0314 1329.9779 1338.5964 1347.0995 1350.6502 1357.2298 1369.4879 1386.3761 1388.0912 1410.5704 1437.4861 1443.4774 1452.4526 1460.0620 1466.4523 1467.3168 1481.1732 1483.0532 1484.6200 1590.9050 1593.8482 1613.3092 1616.2429 2873.9249 2879.2508 2895.8925 2921.2219 2969.8039 2984.7012 2986.1255 3036.8505 3044.7008 3049.9905 3054.9525 3083.3699 3099.3201 3104.5586 3111.2263 3122.3879 3124.1413 3135.6495 3137.1165 3149.2641 3154.8541 3162.4901 3171.3305
redmass: 3.6672 3.4207 4.1450 4.0101 4.1509 4.0482 3.9921 5.3318 3.3165 4.9284 2.1557 4.7380 3.7100 3.1014 4.2928 2.3169 2.9480 3.3469 3.0677 2.2377 4.0763 2.9240 2.8887 2.7545 3.3005 3.2695 5.8812 6.4216 3.9091 4.1478 1.5903 1.8043 2.5948 2.3749 2.2700 1.5003 1.9983 1.5149 2.9260 1.2687 1.5289 1.2644 2.6470 2.7364 1.5726 1.6188 2.1114 1.4820 2.7676 1.3976 1.4134 5.2073 4.5812 1.3882 1.4003 4.0863 2.1031 2.3350 2.4190 2.0082 1.6428 1.6090 1.7238 2.6990 1.7828 1.4693 1.0589 1.0560 1.1297 1.1179 1.9510 2.1669 1.9134 1.3405 1.2586 1.1846 1.2100 1.2364 1.3413 1.4179 1.2504 1.2619 1.3853 1.4799 1.4660 1.6303 1.6956 5.5789 3.4164 1.4563 2.1822 2.0765 1.0893 1.0864 1.0961 1.0833 1.1648 2.1982 2.2259 5.9802 6.2497 6.1060 6.1334 1.0712 1.0707 1.0811 1.0836 1.0633 1.0609 1.0617 1.0960 1.1014 1.0911 1.1017 1.0895 1.0635 1.0871 1.0874 1.0864 1.0862 1.0929 1.0918 1.0954 1.0980 1.1013 1.0963
irintensity: 0.0291 0.0337 0.2425 0.0416 0.7509 0.4968 1.1909 4.1365 1.8257 1.2250 0.0984 1.4542 0.3858 0.2264 1.2591 7.6399 0.8221 4.8234 1.8002 3.9943 2.3460 0.6100 1.6558 3.0110 6.4131 14.2150 1.0461 0.1441 3.2056 5.1006 79.5216 34.4963 16.4716 34.5733 30.5414 65.1613 7.1518 49.4854 7.3980 2.1222 5.0045 2.7787 10.2651 2.3423 2.0521 19.3426 15.0107 4.2205 39.4484 2.0894 0.5965 0.4529 0.6547 2.4789 1.5290 27.4040 7.5366 15.9854 3.1732 28.2933 19.0197 18.3156 1.8944 7.0656 8.4144 10.9863 0.3367 0.1858 2.3720 0.7915 5.0010 26.2434 12.0791 6.0670 4.0599 6.5383 9.0020 7.4719 8.9267 6.9431 14.0626 2.2126 0.1823 3.0656 2.0732 5.1132 11.7320 2.0037 3.1573 104.7252 22.9333 6.2824 6.9734 12.5836 12.8203 1.9401 4.6686 9.7160 19.9734 0.9105 0.5522 2.9302 8.9626 31.9005 103.1973 39.9302 69.7873 40.9363 32.0965 29.1661 78.0319 39.9481 16.5640 86.7389 14.1369 265.2434 29.8809 10.4551 1.7183 1.1676 26.4652 32.2926 15.3427 32.6849 25.8472 8.3451
temp: 298.150 k
press: 1.00000 atm
elementType: 8 7 6 6 6 6 6 6 6 6 6 6 6 6 6 6 6 6 6 6 6 1 1 1 1 1 1 1 1 1 1 1 1 1 1 1 1 1 1 1 1 1 1 1
symmnumber: 1
zpe: 981922.6 jmol-1
zpe.correction: 0.373995 hartree
zpe.thermalcorrener: 0.392605 hartree
zpe.thermalcorrenthalpy: 0.393549 hartree
zpe.thermalcorrgfe: 0.323317 hartree
zpe.sumelectzpe: -866.233454 hartree
zpe.sumelectthermal: -866.214844 hartree
zpe.sumelectthermalent: -866.213899 hartree
zpe.sumelectthermalfe: -866.284131 hartree
dipole: 2.3802 1.4609 -2.1334
dipole: 3.5144
quadrupole: -116.6578 -126.8255 -118.9061
quadrupole: -5.2365 -1.0946 4.7449
quadrupole: 4.1386 -6.0290 1.8904 -5.2365 -1.0946 4.7449
hfenergy: -866.6074484 hartree
pointgroup: C01 [X(C19H23N1O1)]
dipole: -0.900247 0.2276268 1.0244604 debye
polarizability: 233.7651972|20.2923631|189.5219286|-0.9811807|-3.1407997|187.0293883 unknown
InChI: InChI=1S/C19H23NO/c21-19(17-12-6-2-7-13-17)18(16-10-4-1-5-11-16)20-14-8-3-9-15-20/h1-2,4-7,10-13,18-19,21H,3,8-9,14-15H2
charge 0 multiplicity 1
44 atoms
O  -0.298298 -1.144644 -1.862338
N  -2.000316 -0.615834 0.06322
C  -0.551466 -0.516971 0.50209
C  -2.891348 0.509191 0.479818
C  -2.606749 -1.927618 0.454999
C  -4.272781 0.383603 -0.194031
C  -3.984019 -2.127945 -0.208266
C  -4.940265 -0.967723 0.144583
C  0.253381 -1.409142 -0.538003
C  -0.054899 0.921276 0.587528
C  1.761501 -1.207431 -0.515186
C  0.224131 1.486341 1.856462
C  0.141961 1.720306 -0.570204
C  2.451026 -0.734661 -1.656042
C  2.498395 -1.535143 0.651062
C  0.679408 2.818968 1.976848
C  0.596238 3.051237 -0.453219
C  0.863609 3.608625 0.819566
C  3.855176 -0.575804 -1.625784
C  3.900539 -1.37228 0.683779
C  4.585328 -0.890114 -0.456712
H  -0.429753 -0.976316 1.51022
H  -2.417103 1.461538 0.19781
H  -3.020804 0.516694 1.590419
H  -2.715755 -1.980476 1.566962
H  -1.926198 -2.741568 0.150764
H  -4.144161 0.471004 -1.290846
H  -4.909762 1.227508 0.133477
H  -4.404799 -3.098317 0.118122
H  -3.847982 -2.178899 -1.306154
H  -5.174236 -1.000277 1.228925
H  -5.899249 -1.076173 -0.395962
H  0.057759 -2.472902 -0.269356
H  0.086514 0.877211 2.758999
H  -0.047133 1.284889 -1.557111
H  -1.255256 -0.880575 -1.634798
H  1.872294 -0.50866 -2.556166
H  1.978817 -1.920234 1.538484
H  0.89191 3.23684 2.967421
H  0.749001 3.65331 -1.356297
H  1.217678 4.642089 0.906947
H  4.379585 -0.210176 -2.51636
H  4.458562 -1.624544 1.592944
H  5.674219 -0.767107 -0.434516
